{"text_format":"1","workbook":"xlsx","n_sheets":3,"sheets":["R140","Data","Lookup"],"not_rendered":{"charts":0,"images":0,"macros":1,"external_links":0,"defined_names":4,"comments":0,"pivot_tables":0},"unopened":[],"bounds":{"document_bytes":16777216,"sheet_cells":100000,"rows_first":2000,"rows_last":500,"rows_between":2000,"halvings":0,"cell_chars":16384,"cell_head_chars":4096},"cells_cut":0,"cells_raw":0,"read":"whole","date_system":"1900"}

{"sheet":"R140","index":0,"n_rows":47,"n_cols":19,"rows_kept":47,"cut":false,"hidden":false,"merged":[[6,5,6,7],[6,8,6,13],[6,17,6,18],[7,17,7,18],[9,17,9,18],[9,1,9,3],[8,1,8,3],[8,6,8,7],[8,8,8,10],[8,11,8,13],[8,17,8,18],[9,6,9,7]]}
[null,"R140: THEATRE SERVICES",null,null,null,null,null,null,null,null,null,null,null,null,null,null,null,null,"This is a Public Health Scotland National Statistics release"]
[null,"April 2019 - March 2020",null,null,null,null,null,null,null,null,null,null,null,null,null,null,null,null,"23rd February 2021"]
[null,"General hospitals (mainly acute)","←",null,null,"* Use drop-down menu to select specialties"]
[{"$f":"B3","v":"General hospitals (mainly acute)"},null,null,null,null,"* If menu is not active, change macro security settings using Tools, Macro, Security - set security level to Medium and re-open the report."]
[1,{"$f":"IF(ISNA(VLOOKUP(CONCATENATE($A5,$A$4),Data!$A$2:$S$850,2,FALSE)),\"\",VLOOKUP(CONCATENATE($A5,$A$4),Data!$A$2:$S$850,2,FALSE))","v":"Number of Hospitals: 35"}]
[]
[null,null,null,null,"Number","Theatre Hours Used",null,null,"Direct Costs",null,null,null,null,null,"Allocated","Total","Income","Net Cost"]
[null,null,null,null,"of",null,null,null,null,null,null,null,null,null,"Costs","Expenditure","ACT","per"]
[null,"Hospital, Board Cipher",null,null,"Theatres","Per","Per Theatre",null,"Staff",null,null,"Supplies",null,null,null,"(net of","(netted in","Theatre"]
[null,"& Classification",null,null,null,"Week","Per Week",null,null,null,null,null,null,null,null,"ACT","theatre","Hour Used"]
[null,null,null,null,null,null,"Hours","Group","Medical","Nursing","Other","Drugs","CSSD","Other",null,"income)","expenditure)"]
[null,null,null,null,null,null,null,"Index","& Dental",null,null,null,null,null,null,null,null,null,"Group"]
[null,null,null,null,null,null,null,null,"£000","£000","£000","£000","£000","£000","£000","£000","£000","£","Index"]
[2,{"$f":"IF(ISNA(VLOOKUP(CONCATENATE($A14,$A$4),Data!$A$2:$S$100,Lookup!C$3,FALSE)),\"\",VLOOKUP(CONCATENATE($A14,$A$4),Data!$A$2:$S$100,Lookup!C$3,FALSE))","v":"Totals or Averages"},{"$f":"IF(ISNA(VLOOKUP(CONCATENATE($A14,$A$4),Data!$A$2:$S$100,Lookup!D$3,FALSE)),\"\",VLOOKUP(CONCATENATE($A14,$A$4),Data!$A$2:$S$100,Lookup!D$3,FALSE))","v":0},{"$f":"IF(ISNA(VLOOKUP(CONCATENATE($A14,$A$4),Data!$A$2:$S$100,Lookup!E$3,FALSE)),\"\",VLOOKUP(CONCATENATE($A14,$A$4),Data!$A$2:$S$100,Lookup!E$3,FALSE))","v":0},{"$f":"IF(ISNA(VLOOKUP(CONCATENATE($A14,$A$4),Data!$A$2:$S$100,Lookup!F$3,FALSE)),\"\",VLOOKUP(CONCATENATE($A14,$A$4),Data!$A$2:$S$100,Lookup!F$3,FALSE))","v":340.59999999999997},{"$f":"IF(ISNA(VLOOKUP(CONCATENATE($A14,$A$4),Data!$A$2:$S$100,Lookup!G$3,FALSE)),\"\",VLOOKUP(CONCATENATE($A14,$A$4),Data!$A$2:$S$100,Lookup!G$3,FALSE))","v":8764.8655769230754},{"$f":"IF(ISNA(VLOOKUP(CONCATENATE($A14,$A$4),Data!$A$2:$S$100,Lookup!H$3,FALSE)),\"\",VLOOKUP(CONCATENATE($A14,$A$4),Data!$A$2:$S$100,Lookup!H$3,FALSE))","v":25.733604160079494},{"$f":"IF(ISNA(VLOOKUP(CONCATENATE($A14,$A$4),Data!$A$2:$S$100,Lookup!I$3,FALSE)),\"\",VLOOKUP(CONCATENATE($A14,$A$4),Data!$A$2:$S$100,Lookup!I$3,FALSE))","v":100},{"$f":"IF(ISNA(VLOOKUP(CONCATENATE($A14,$A$4),Data!$A$2:$S$100,Lookup!J$3,FALSE)),\"\",VLOOKUP(CONCATENATE($A14,$A$4),Data!$A$2:$S$100,Lookup!J$3,FALSE))","v":134255.93963000001},{"$f":"IF(ISNA(VLOOKUP(CONCATENATE($A14,$A$4),Data!$A$2:$S$100,Lookup!K$3,FALSE)),\"\",VLOOKUP(CONCATENATE($A14,$A$4),Data!$A$2:$S$100,Lookup!K$3,FALSE))","v":159650.07265999998},{"$f":"IF(ISNA(VLOOKUP(CONCATENATE($A14,$A$4),Data!$A$2:$S$100,Lookup!L$3,FALSE)),\"\",VLOOKUP(CONCATENATE($A14,$A$4),Data!$A$2:$S$100,Lookup!L$3,FALSE))","v":17688.520419999997},{"$f":"IF(ISNA(VLOOKUP(CONCATENATE($A14,$A$4),Data!$A$2:$S$100,Lookup!M$3,FALSE)),\"\",VLOOKUP(CONCATENATE($A14,$A$4),Data!$A$2:$S$100,Lookup!M$3,FALSE))","v":15431.274279999994},{"$f":"IF(ISNA(VLOOKUP(CONCATENATE($A14,$A$4),Data!$A$2:$S$100,Lookup!N$3,FALSE)),\"\",VLOOKUP(CONCATENATE($A14,$A$4),Data!$A$2:$S$100,Lookup!N$3,FALSE))","v":17017.006959999995},{"$f":"IF(ISNA(VLOOKUP(CONCATENATE($A14,$A$4),Data!$A$2:$S$100,Lookup!O$3,FALSE)),\"\",VLOOKUP(CONCATENATE($A14,$A$4),Data!$A$2:$S$100,Lookup!O$3,FALSE))","v":132790.64257},{"$f":"IF(ISNA(VLOOKUP(CONCATENATE($A14,$A$4),Data!$A$2:$S$100,Lookup!P$3,FALSE)),\"\",VLOOKUP(CONCATENATE($A14,$A$4),Data!$A$2:$S$100,Lookup!P$3,FALSE))","v":110147.22976999999},{"$f":"IF(ISNA(VLOOKUP(CONCATENATE($A14,$A$4),Data!$A$2:$S$100,Lookup!Q$3,FALSE)),\"\",VLOOKUP(CONCATENATE($A14,$A$4),Data!$A$2:$S$100,Lookup!Q$3,FALSE))","v":586980.6862900001},{"$f":"IF(ISNA(VLOOKUP(CONCATENATE($A14,$A$4),Data!$A$2:$S$100,Lookup!R$3,FALSE)),\"\",VLOOKUP(CONCATENATE($A14,$A$4),Data!$A$2:$S$100,Lookup!R$3,FALSE))","v":8688.5061800000003},{"$f":"IF(ISNA(VLOOKUP(CONCATENATE($A14,$A$4),Data!$A$2:$S$100,Lookup!S$3,FALSE)),\"\",VLOOKUP(CONCATENATE($A14,$A$4),Data!$A$2:$S$100,Lookup!S$3,FALSE))","v":1287.8794343043705},{"$f":"IF(ISNA(VLOOKUP(CONCATENATE($A14,$A$4),Data!$A$2:$S$100,Lookup!T$3,FALSE)),\"\",VLOOKUP(CONCATENATE($A14,$A$4),Data!$A$2:$S$100,Lookup!T$3,FALSE))","v":100}]
[3,{"$f":"IF(ISNA(VLOOKUP(CONCATENATE($A15,$A$4),Data!$A$2:$S$100,Lookup!C$3,FALSE)),\"\",VLOOKUP(CONCATENATE($A15,$A$4),Data!$A$2:$S$100,Lookup!C$3,FALSE))","v":"Queen Elizabeth University Hospital"},{"$f":"IF(ISNA(VLOOKUP(CONCATENATE($A15,$A$4),Data!$A$2:$S$100,Lookup!D$3,FALSE)),\"\",VLOOKUP(CONCATENATE($A15,$A$4),Data!$A$2:$S$100,Lookup!D$3,FALSE))","v":"G"},{"$f":"IF(ISNA(VLOOKUP(CONCATENATE($A15,$A$4),Data!$A$2:$S$100,Lookup!E$3,FALSE)),\"\",VLOOKUP(CONCATENATE($A15,$A$4),Data!$A$2:$S$100,Lookup!E$3,FALSE))","v":"A1"},{"$f":"IF(ISNA(VLOOKUP(CONCATENATE($A15,$A$4),Data!$A$2:$S$100,Lookup!F$3,FALSE)),\"\",VLOOKUP(CONCATENATE($A15,$A$4),Data!$A$2:$S$100,Lookup!F$3,FALSE))","v":29},{"$f":"IF(ISNA(VLOOKUP(CONCATENATE($A15,$A$4),Data!$A$2:$S$100,Lookup!G$3,FALSE)),\"\",VLOOKUP(CONCATENATE($A15,$A$4),Data!$A$2:$S$100,Lookup!G$3,FALSE))","v":883.15384615384619},{"$f":"IF(ISNA(VLOOKUP(CONCATENATE($A15,$A$4),Data!$A$2:$S$100,Lookup!H$3,FALSE)),\"\",VLOOKUP(CONCATENATE($A15,$A$4),Data!$A$2:$S$100,Lookup!H$3,FALSE))","v":30.453580901856764},{"$f":"IF(ISNA(VLOOKUP(CONCATENATE($A15,$A$4),Data!$A$2:$S$100,Lookup!I$3,FALSE)),\"\",VLOOKUP(CONCATENATE($A15,$A$4),Data!$A$2:$S$100,Lookup!I$3,FALSE))","v":118.34168549580536},{"$f":"IF(ISNA(VLOOKUP(CONCATENATE($A15,$A$4),Data!$A$2:$S$100,Lookup!J$3,FALSE)),\"\",VLOOKUP(CONCATENATE($A15,$A$4),Data!$A$2:$S$100,Lookup!J$3,FALSE))","v":11976.235000000001},{"$f":"IF(ISNA(VLOOKUP(CONCATENATE($A15,$A$4),Data!$A$2:$S$100,Lookup!K$3,FALSE)),\"\",VLOOKUP(CONCATENATE($A15,$A$4),Data!$A$2:$S$100,Lookup!K$3,FALSE))","v":17424.784},{"$f":"IF(ISNA(VLOOKUP(CONCATENATE($A15,$A$4),Data!$A$2:$S$100,Lookup!L$3,FALSE)),\"\",VLOOKUP(CONCATENATE($A15,$A$4),Data!$A$2:$S$100,Lookup!L$3,FALSE))","v":424.57499999999999},{"$f":"IF(ISNA(VLOOKUP(CONCATENATE($A15,$A$4),Data!$A$2:$S$100,Lookup!M$3,FALSE)),\"\",VLOOKUP(CONCATENATE($A15,$A$4),Data!$A$2:$S$100,Lookup!M$3,FALSE))","v":1688.0740000000001},{"$f":"IF(ISNA(VLOOKUP(CONCATENATE($A15,$A$4),Data!$A$2:$S$100,Lookup!N$3,FALSE)),\"\",VLOOKUP(CONCATENATE($A15,$A$4),Data!$A$2:$S$100,Lookup!N$3,FALSE))","v":0.161},{"$f":"IF(ISNA(VLOOKUP(CONCATENATE($A15,$A$4),Data!$A$2:$S$100,Lookup!O$3,FALSE)),\"\",VLOOKUP(CONCATENATE($A15,$A$4),Data!$A$2:$S$100,Lookup!O$3,FALSE))","v":16686.925999999999},{"$f":"IF(ISNA(VLOOKUP(CONCATENATE($A15,$A$4),Data!$A$2:$S$100,Lookup!P$3,FALSE)),\"\",VLOOKUP(CONCATENATE($A15,$A$4),Data!$A$2:$S$100,Lookup!P$3,FALSE))","v":8632.8029999999999},{"$f":"IF(ISNA(VLOOKUP(CONCATENATE($A15,$A$4),Data!$A$2:$S$100,Lookup!Q$3,FALSE)),\"\",VLOOKUP(CONCATENATE($A15,$A$4),Data!$A$2:$S$100,Lookup!Q$3,FALSE))","v":56833.557999999997},{"$f":"IF(ISNA(VLOOKUP(CONCATENATE($A15,$A$4),Data!$A$2:$S$100,Lookup!R$3,FALSE)),\"\",VLOOKUP(CONCATENATE($A15,$A$4),Data!$A$2:$S$100,Lookup!R$3,FALSE))","v":3605.1750000000002},{"$f":"IF(ISNA(VLOOKUP(CONCATENATE($A15,$A$4),Data!$A$2:$S$100,Lookup!S$3,FALSE)),\"\",VLOOKUP(CONCATENATE($A15,$A$4),Data!$A$2:$S$100,Lookup!S$3,FALSE))","v":1237.5567894782685},{"$f":"IF(ISNA(VLOOKUP(CONCATENATE($A15,$A$4),Data!$A$2:$S$100,Lookup!T$3,FALSE)),\"\",VLOOKUP(CONCATENATE($A15,$A$4),Data!$A$2:$S$100,Lookup!T$3,FALSE))","v":96.092596598276842}]
{"$rows_left_out":33}
{"sheet":"Data","index":1,"n_rows":56,"n_cols":19,"rows_kept":56,"cut":false,"hidden":false,"merged":[]}
["lookup","org_loc","region","HospGroup","nothea","theahou1","theahou2","Thgrpind","medden","nursing","othstaff","drugs","cssd","othsupp","allocate","totexp","income","costthu","cogrpind"]
["1General hospitals (mainly acute)","Number of Hospitals: 35",null,null,"-","-","-","-","-","-","-","-","-","-","-","-","-","-","-"]
["2General hospitals (mainly acute)","Totals or Averages",null,null,340.59999999999997,8764.8655769230754,25.733604160079494,100,134255.93963000001,159650.07265999998,17688.520419999997,15431.274279999994,17017.006959999995,132790.64257,110147.22976999999,586980.6862900001,8688.5061800000003,1287.8794343043705,100]
["3General hospitals (mainly acute)","Queen Elizabeth University Hospital","G","A1",29,883.15384615384619,30.453580901856764,118.34168549580536,11976.235000000001,17424.784,424.57499999999999,1688.0740000000001,0.161,16686.925999999999,8632.8029999999999,56833.557999999997,3605.1750000000002,1237.5567894782685,96.092596598276842]
["4General hospitals (mainly acute)","Glasgow Royal Infirmary","G","A1",23,623.67307692307691,27.116220735785951,105.3728057955104,7317.2879999999996,12510.713,-0.191,884.08699999999999,6.8819999999999997,8481.1280000000006,6674.835,35874.741999999998,2789.31,1106.1867349141253,85.892103363822727]
["5General hospitals (mainly acute)","Edinburgh Royal Infirmary","S","A1",27,784.96153846153845,29.072649572649571,112.97542851673275,11055.291999999999,11715.736000000001,3737.7339999999999,1492.2909999999999,2445.0390000000002,18926.703000000001,1419.5920000000001,50792.387000000002,"-",1244.3624626390317,96.62103683728408]
["6General hospitals (mainly acute)","Ninewells","T","A1",18,613.24692307692305,34.069273504273504,132.3921565449628,10252.469499999999,10952.9897,1287.46795,927.56191999999999,2071.6816800000001,7374.4057899999998,15595.303,48461.879540000002,"-",1519.712838096337,118.00117290615701]
["7General hospitals (mainly acute)","Aberdeen Royal Infirmary","N","A1",25,494.48076923076923,19.779230769230768,76.861486817747277,10862.116,12012.795,995.58500000000004,1250.76,286.79000000000002,11334.467000000001,7348.5029999999997,44091.016000000003,"-",1714.7363590401742,133.14416810812452]
["8General hospitals (mainly acute)","Western General, Edinburgh","S","A1",11,325.03846153846155,29.54895104895105,114.82632150995119,5655.6019999999999,5994.5050000000001,1205.557,631.31899999999996,698.53800000000001,6602.2070000000003,683.57799999999997,21471.306,"-",1270.3411430599929,98.638203951610521]
["9General hospitals (mainly acute)","West Hospitals","G","A1",11,165.96153846153845,15.087412587412587,58.629224626131723,2359.2869999999998,4103.415,10.031000000000001,459.084,0.28599999999999998,2517.9209999999998,3450.623,12900.647000000001,917.05600000000004,1494.8606025492468,116.07147087931209]
["10General hospitals (mainly acute)","Forth Valley Royal Hospital","V","A2",14.81,364.70692307692303,24.62572066690905,95.694798574351665,5659.80242,4105.0776000000005,710.07154000000003,317.72953999999999,3956.4937799999998,220.85895000000002,5147.5367000000006,20117.570530000001,"-",1060.7869822766015,82.366947869586127]
["11General hospitals (mainly acute)","Royal Alexandra Hospital","G","A2",12,296.21153846153845,24.684294871794872,95.922416145996309,5591.3119999999999,7239.3819999999996,25.762,622.495,192.77799999999999,4550.5119999999997,3636.5050000000001,21858.745999999999,"-",1419.1226384470558,110.19064367726116]
["12General hospitals (mainly acute)","Victoria Kirkcaldy","F","A2",12,445.36538461538464,37.113782051282051,144.22302379569749,4806.259,4635.3829999999998,995.61900000000003,345.59199999999998,95.873000000000005,6002.3419999999996,740.30899999999997,17621.377,"-",760.88678267628131,59.080591118163426]
["13General hospitals (mainly acute)","Wishaw General","L","A2",12,304.73076923076923,25.39423076923077,98.681205365802612,5592.7640000000001,6229.8320000000003,266.774,453.76400000000001,139.374,5123.1220000000003,4937.6009999999997,22743.231,"-",1435.2663763725861,111.44415681642006]
["14General hospitals (mainly acute)","Crosshouse Hospital","A","A2",13,471.23076923076923,36.248520710059168,140.86064464413985,5402.116,6930.4380000000001,71.516999999999996,567.66700000000003,1171.2539999999999,4352.2889999999998,4320.3069999999998,22815.588,"-",931.09647404505392,72.296866402558265]
{"$rows_left_out":42}
{"sheet":"Lookup","index":2,"n_rows":7,"n_cols":38,"rows_kept":7,"cut":false,"hidden":false,"merged":[]}
[]
[]
["General hospitals (mainly acute)",null,2,3,4,5,6,7,8,9,10,11,12,13,14,15,16,17,18,19,20,21,22,23,24,25,26,27,28,29,30,31,32,33,34,35,36,37]
["Community hospitals"]
["Long stay hospitals"]
["Maternity hospitals"]
["Other - miscellaneous hospitals"]