{"text_format":"1","workbook":"xlsx","n_sheets":3,"sheets":["R140","Data","Lookup"],"not_rendered":{"charts":0,"images":0,"macros":1,"external_links":0,"defined_names":4,"comments":0,"pivot_tables":0},"unopened":[],"bounds":{"document_bytes":16777216,"sheet_cells":100000,"rows_first":2000,"rows_last":500,"rows_between":2000,"halvings":0,"cell_chars":16384,"cell_head_chars":4096},"cells_cut":0,"cells_raw":0,"read":"whole","date_system":"1900"}

{"sheet":"R140","index":0,"n_rows":47,"n_cols":19,"rows_kept":47,"cut":false,"hidden":false,"merged":[[6,5,6,7],[6,8,6,13],[6,17,6,18],[7,17,7,18],[9,17,9,18],[9,1,9,3],[8,1,8,3],[8,6,8,7],[8,8,8,10],[8,11,8,13],[8,17,8,18],[9,6,9,7]]}
[null,"R140: THEATRE SERVICES",null,null,null,null,null,null,null,null,null,null,null,null,null,null,null,null,"This is a Public Health Scotland National Statistics release"]
[null,"April 2019 - March 2020",null,null,null,null,null,null,null,null,null,null,null,null,null,null,null,null,"23rd February 2021"]
[null,"General hospitals (mainly acute)","←",null,null,"* Use drop-down menu to select specialties"]
[{"$f":"B3","v":"General hospitals (mainly acute)"},null,null,null,null,"* If menu is not active, change macro security settings using Tools, Macro, Security - set security level to Medium and re-open the report."]
[1,{"$f":"IF(ISNA(VLOOKUP(CONCATENATE($A5,$A$4),Data!$A$2:$S$850,2,FALSE)),\"\",VLOOKUP(CONCATENATE($A5,$A$4),Data!$A$2:$S$850,2,FALSE))","v":"Number of Hospitals: 35"}]
[]
[null,null,null,null,"Number","Theatre Hours Used",null,null,"Direct Costs",null,null,null,null,null,"Allocated","Total","Income","Net Cost"]
[null,null,null,null,"of",null,null,null,null,null,null,null,null,null,"Costs","Expenditure","ACT","per"]
[null,"Hospital, Board Cipher",null,null,"Theatres","Per","Per Theatre",null,"Staff",null,null,"Supplies",null,null,null,"(net of","(netted in","Theatre"]
[null,"& Classification",null,null,null,"Week","Per Week",null,null,null,null,null,null,null,null,"ACT","theatre","Hour Used"]
[null,null,null,null,null,null,"Hours","Group","Medical","Nursing","Other","Drugs","CSSD","Other",null,"income)","expenditure)"]
[null,null,null,null,null,null,null,"Index","& Dental",null,null,null,null,null,null,null,null,null,"Group"]
[null,null,null,null,null,null,null,null,"£000","£000","£000","£000","£000","£000","£000","£000","£000","£","Index"]
[2,{"$f":"IF(ISNA(VLOOKUP(CONCATENATE($A14,$A$4),Data!$A$2:$S$100,Lookup!C$3,FALSE)),\"\",VLOOKUP(CONCATENATE($A14,$A$4),Data!$A$2:$S$100,Lookup!C$3,FALSE))","v":"Totals or Averages"},{"$f":"IF(ISNA(VLOOKUP(CONCATENATE($A14,$A$4),Data!$A$2:$S$100,Lookup!D$3,FALSE)),\"\",VLOOKUP(CONCATENATE($A14,$A$4),Data!$A$2:$S$100,Lookup!D$3,FALSE))","v":0},{"$f":"IF(ISNA(VLOOKUP(CONCATENATE($A14,$A$4),Data!$A$2:$S$100,Lookup!E$3,FALSE)),\"\",VLOOKUP(CONCATENATE($A14,$A$4),Data!$A$2:$S$100,Lookup!E$3,FALSE))","v":0},{"$f":"IF(ISNA(VLOOKUP(CONCATENATE($A14,$A$4),Data!$A$2:$S$100,Lookup!F$3,FALSE)),\"\",VLOOKUP(CONCATENATE($A14,$A$4),Data!$A$2:$S$100,Lookup!F$3,FALSE))","v":340.59999999999997},{"$f":"IF(ISNA(VLOOKUP(CONCATENATE($A14,$A$4),Data!$A$2:$S$100,Lookup!G$3,FALSE)),\"\",VLOOKUP(CONCATENATE($A14,$A$4),Data!$A$2:$S$100,Lookup!G$3,FALSE))","v":8764.8655769230754},{"$f":"IF(ISNA(VLOOKUP(CONCATENATE($A14,$A$4),Data!$A$2:$S$100,Lookup!H$3,FALSE)),\"\",VLOOKUP(CONCATENATE($A14,$A$4),Data!$A$2:$S$100,Lookup!H$3,FALSE))","v":25.733604160079494},{"$f":"IF(ISNA(VLOOKUP(CONCATENATE($A14,$A$4),Data!$A$2:$S$100,Lookup!I$3,FALSE)),\"\",VLOOKUP(CONCATENATE($A14,$A$4),Data!$A$2:$S$100,Lookup!I$3,FALSE))","v":100},{"$f":"IF(ISNA(VLOOKUP(CONCATENATE($A14,$A$4),Data!$A$2:$S$100,Lookup!J$3,FALSE)),\"\",VLOOKUP(CONCATENATE($A14,$A$4),Data!$A$2:$S$100,Lookup!J$3,FALSE))","v":134255.93963000001},{"$f":"IF(ISNA(VLOOKUP(CONCATENATE($A14,$A$4),Data!$A$2:$S$100,Lookup!K$3,FALSE)),\"\",VLOOKUP(CONCATENATE($A14,$A$4),Data!$A$2:$S$100,Lookup!K$3,FALSE))","v":159650.07265999998},{"$f":"IF(ISNA(VLOOKUP(CONCATENATE($A14,$A$4),Data!$A$2:$S$100,Lookup!L$3,FALSE)),\"\",VLOOKUP(CONCATENATE($A14,$A$4),Data!$A$2:$S$100,Lookup!L$3,FALSE))","v":17688.520419999997},{"$f":"IF(ISNA(VLOOKUP(CONCATENATE($A14,$A$4),Data!$A$2:$S$100,Lookup!M$3,FALSE)),\"\",VLOOKUP(CONCATENATE($A14,$A$4),Data!$A$2:$S$100,Lookup!M$3,FALSE))","v":15431.274279999994},{"$f":"IF(ISNA(VLOOKUP(CONCATENATE($A14,$A$4),Data!$A$2:$S$100,Lookup!N$3,FALSE)),\"\",VLOOKUP(CONCATENATE($A14,$A$4),Data!$A$2:$S$100,Lookup!N$3,FALSE))","v":17017.006959999995},{"$f":"IF(ISNA(VLOOKUP(CONCATENATE($A14,$A$4),Data!$A$2:$S$100,Lookup!O$3,FALSE)),\"\",VLOOKUP(CONCATENATE($A14,$A$4),Data!$A$2:$S$100,Lookup!O$3,FALSE))","v":132790.64257},{"$f":"IF(ISNA(VLOOKUP(CONCATENATE($A14,$A$4),Data!$A$2:$S$100,Lookup!P$3,FALSE)),\"\",VLOOKUP(CONCATENATE($A14,$A$4),Data!$A$2:$S$100,Lookup!P$3,FALSE))","v":110147.22976999999},{"$f":"IF(ISNA(VLOOKUP(CONCATENATE($A14,$A$4),Data!$A$2:$S$100,Lookup!Q$3,FALSE)),\"\",VLOOKUP(CONCATENATE($A14,$A$4),Data!$A$2:$S$100,Lookup!Q$3,FALSE))","v":586980.6862900001},{"$f":"IF(ISNA(VLOOKUP(CONCATENATE($A14,$A$4),Data!$A$2:$S$100,Lookup!R$3,FALSE)),\"\",VLOOKUP(CONCATENATE($A14,$A$4),Data!$A$2:$S$100,Lookup!R$3,FALSE))","v":8688.5061800000003},{"$f":"IF(ISNA(VLOOKUP(CONCATENATE($A14,$A$4),Data!$A$2:$S$100,Lookup!S$3,FALSE)),\"\",VLOOKUP(CONCATENATE($A14,$A$4),Data!$A$2:$S$100,Lookup!S$3,FALSE))","v":1287.8794343043705},{"$f":"IF(ISNA(VLOOKUP(CONCATENATE($A14,$A$4),Data!$A$2:$S$100,Lookup!T$3,FALSE)),\"\",VLOOKUP(CONCATENATE($A14,$A$4),Data!$A$2:$S$100,Lookup!T$3,FALSE))","v":100}]
[3,{"$f":"IF(ISNA(VLOOKUP(CONCATENATE($A15,$A$4),Data!$A$2:$S$100,Lookup!C$3,FALSE)),\"\",VLOOKUP(CONCATENATE($A15,$A$4),Data!$A$2:$S$100,Lookup!C$3,FALSE))","v":"Queen Elizabeth University Hospital"},{"$f":"IF(ISNA(VLOOKUP(CONCATENATE($A15,$A$4),Data!$A$2:$S$100,Lookup!D$3,FALSE)),\"\",VLOOKUP(CONCATENATE($A15,$A$4),Data!$A$2:$S$100,Lookup!D$3,FALSE))","v":"G"},{"$f":"IF(ISNA(VLOOKUP(CONCATENATE($A15,$A$4),Data!$A$2:$S$100,Lookup!E$3,FALSE)),\"\",VLOOKUP(CONCATENATE($A15,$A$4),Data!$A$2:$S$100,Lookup!E$3,FALSE))","v":"A1"},{"$f":"IF(ISNA(VLOOKUP(CONCATENATE($A15,$A$4),Data!$A$2:$S$100,Lookup!F$3,FALSE)),\"\",VLOOKUP(CONCATENATE($A15,$A$4),Data!$A$2:$S$100,Lookup!F$3,FALSE))","v":29},{"$f":"IF(ISNA(VLOOKUP(CONCATENATE($A15,$A$4),Data!$A$2:$S$100,Lookup!G$3,FALSE)),\"\",VLOOKUP(CONCATENATE($A15,$A$4),Data!$A$2:$S$100,Lookup!G$3,FALSE))","v":883.15384615384619},{"$f":"IF(ISNA(VLOOKUP(CONCATENATE($A15,$A$4),Data!$A$2:$S$100,Lookup!H$3,FALSE)),\"\",VLOOKUP(CONCATENATE($A15,$A$4),Data!$A$2:$S$100,Lookup!H$3,FALSE))","v":30.453580901856764},{"$f":"IF(ISNA(VLOOKUP(CONCATENATE($A15,$A$4),Data!$A$2:$S$100,Lookup!I$3,FALSE)),\"\",VLOOKUP(CONCATENATE($A15,$A$4),Data!$A$2:$S$100,Lookup!I$3,FALSE))","v":118.34168549580536},{"$f":"IF(ISNA(VLOOKUP(CONCATENATE($A15,$A$4),Data!$A$2:$S$100,Lookup!J$3,FALSE)),\"\",VLOOKUP(CONCATENATE($A15,$A$4),Data!$A$2:$S$100,Lookup!J$3,FALSE))","v":11976.235000000001},{"$f":"IF(ISNA(VLOOKUP(CONCATENATE($A15,$A$4),Data!$A$2:$S$100,Lookup!K$3,FALSE)),\"\",VLOOKUP(CONCATENATE($A15,$A$4),Data!$A$2:$S$100,Lookup!K$3,FALSE))","v":17424.784},{"$f":"IF(ISNA(VLOOKUP(CONCATENATE($A15,$A$4),Data!$A$2:$S$100,Lookup!L$3,FALSE)),\"\",VLOOKUP(CONCATENATE($A15,$A$4),Data!$A$2:$S$100,Lookup!L$3,FALSE))","v":424.57499999999999},{"$f":"IF(ISNA(VLOOKUP(CONCATENATE($A15,$A$4),Data!$A$2:$S$100,Lookup!M$3,FALSE)),\"\",VLOOKUP(CONCATENATE($A15,$A$4),Data!$A$2:$S$100,Lookup!M$3,FALSE))","v":1688.0740000000001},{"$f":"IF(ISNA(VLOOKUP(CONCATENATE($A15,$A$4),Data!$A$2:$S$100,Lookup!N$3,FALSE)),\"\",VLOOKUP(CONCATENATE($A15,$A$4),Data!$A$2:$S$100,Lookup!N$3,FALSE))","v":0.161},{"$f":"IF(ISNA(VLOOKUP(CONCATENATE($A15,$A$4),Data!$A$2:$S$100,Lookup!O$3,FALSE)),\"\",VLOOKUP(CONCATENATE($A15,$A$4),Data!$A$2:$S$100,Lookup!O$3,FALSE))","v":16686.925999999999},{"$f":"IF(ISNA(VLOOKUP(CONCATENATE($A15,$A$4),Data!$A$2:$S$100,Lookup!P$3,FALSE)),\"\",VLOOKUP(CONCATENATE($A15,$A$4),Data!$A$2:$S$100,Lookup!P$3,FALSE))","v":8632.8029999999999},{"$f":"IF(ISNA(VLOOKUP(CONCATENATE($A15,$A$4),Data!$A$2:$S$100,Lookup!Q$3,FALSE)),\"\",VLOOKUP(CONCATENATE($A15,$A$4),Data!$A$2:$S$100,Lookup!Q$3,FALSE))","v":56833.557999999997},{"$f":"IF(ISNA(VLOOKUP(CONCATENATE($A15,$A$4),Data!$A$2:$S$100,Lookup!R$3,FALSE)),\"\",VLOOKUP(CONCATENATE($A15,$A$4),Data!$A$2:$S$100,Lookup!R$3,FALSE))","v":3605.1750000000002},{"$f":"IF(ISNA(VLOOKUP(CONCATENATE($A15,$A$4),Data!$A$2:$S$100,Lookup!S$3,FALSE)),\"\",VLOOKUP(CONCATENATE($A15,$A$4),Data!$A$2:$S$100,Lookup!S$3,FALSE))","v":1237.5567894782685},{"$f":"IF(ISNA(VLOOKUP(CONCATENATE($A15,$A$4),Data!$A$2:$S$100,Lookup!T$3,FALSE)),\"\",VLOOKUP(CONCATENATE($A15,$A$4),Data!$A$2:$S$100,Lookup!T$3,FALSE))","v":96.092596598276842}]
[4,{"$f":"IF(ISNA(VLOOKUP(CONCATENATE($A16,$A$4),Data!$A$2:$S$100,Lookup!C$3,FALSE)),\"\",VLOOKUP(CONCATENATE($A16,$A$4),Data!$A$2:$S$100,Lookup!C$3,FALSE))","v":"Glasgow Royal Infirmary"},{"$f":"IF(ISNA(VLOOKUP(CONCATENATE($A16,$A$4),Data!$A$2:$S$100,Lookup!D$3,FALSE)),\"\",VLOOKUP(CONCATENATE($A16,$A$4),Data!$A$2:$S$100,Lookup!D$3,FALSE))","v":"G"},{"$f":"IF(ISNA(VLOOKUP(CONCATENATE($A16,$A$4),Data!$A$2:$S$100,Lookup!E$3,FALSE)),\"\",VLOOKUP(CONCATENATE($A16,$A$4),Data!$A$2:$S$100,Lookup!E$3,FALSE))","v":"A1"},{"$f":"IF(ISNA(VLOOKUP(CONCATENATE($A16,$A$4),Data!$A$2:$S$100,Lookup!F$3,FALSE)),\"\",VLOOKUP(CONCATENATE($A16,$A$4),Data!$A$2:$S$100,Lookup!F$3,FALSE))","v":23},{"$f":"IF(ISNA(VLOOKUP(CONCATENATE($A16,$A$4),Data!$A$2:$S$100,Lookup!G$3,FALSE)),\"\",VLOOKUP(CONCATENATE($A16,$A$4),Data!$A$2:$S$100,Lookup!G$3,FALSE))","v":623.67307692307691},{"$f":"IF(ISNA(VLOOKUP(CONCATENATE($A16,$A$4),Data!$A$2:$S$100,Lookup!H$3,FALSE)),\"\",VLOOKUP(CONCATENATE($A16,$A$4),Data!$A$2:$S$100,Lookup!H$3,FALSE))","v":27.116220735785951},{"$f":"IF(ISNA(VLOOKUP(CONCATENATE($A16,$A$4),Data!$A$2:$S$100,Lookup!I$3,FALSE)),\"\",VLOOKUP(CONCATENATE($A16,$A$4),Data!$A$2:$S$100,Lookup!I$3,FALSE))","v":105.3728057955104},{"$f":"IF(ISNA(VLOOKUP(CONCATENATE($A16,$A$4),Data!$A$2:$S$100,Lookup!J$3,FALSE)),\"\",VLOOKUP(CONCATENATE($A16,$A$4),Data!$A$2:$S$100,Lookup!J$3,FALSE))","v":7317.2879999999996},{"$f":"IF(ISNA(VLOOKUP(CONCATENATE($A16,$A$4),Data!$A$2:$S$100,Lookup!K$3,FALSE)),\"\",VLOOKUP(CONCATENATE($A16,$A$4),Data!$A$2:$S$100,Lookup!K$3,FALSE))","v":12510.713},{"$f":"IF(ISNA(VLOOKUP(CONCATENATE($A16,$A$4),Data!$A$2:$S$100,Lookup!L$3,FALSE)),\"\",VLOOKUP(CONCATENATE($A16,$A$4),Data!$A$2:$S$100,Lookup!L$3,FALSE))","v":-0.191},{"$f":"IF(ISNA(VLOOKUP(CONCATENATE($A16,$A$4),Data!$A$2:$S$100,Lookup!M$3,FALSE)),\"\",VLOOKUP(CONCATENATE($A16,$A$4),Data!$A$2:$S$100,Lookup!M$3,FALSE))","v":884.08699999999999},{"$f":"IF(ISNA(VLOOKUP(CONCATENATE($A16,$A$4),Data!$A$2:$S$100,Lookup!N$3,FALSE)),\"\",VLOOKUP(CONCATENATE($A16,$A$4),Data!$A$2:$S$100,Lookup!N$3,FALSE))","v":6.8819999999999997},{"$f":"IF(ISNA(VLOOKUP(CONCATENATE($A16,$A$4),Data!$A$2:$S$100,Lookup!O$3,FALSE)),\"\",VLOOKUP(CONCATENATE($A16,$A$4),Data!$A$2:$S$100,Lookup!O$3,FALSE))","v":8481.1280000000006},{"$f":"IF(ISNA(VLOOKUP(CONCATENATE($A16,$A$4),Data!$A$2:$S$100,Lookup!P$3,FALSE)),\"\",VLOOKUP(CONCATENATE($A16,$A$4),Data!$A$2:$S$100,Lookup!P$3,FALSE))","v":6674.835},{"$f":"IF(ISNA(VLOOKUP(CONCATENATE($A16,$A$4),Data!$A$2:$S$100,Lookup!Q$3,FALSE)),\"\",VLOOKUP(CONCATENATE($A16,$A$4),Data!$A$2:$S$100,Lookup!Q$3,FALSE))","v":35874.741999999998},{"$f":"IF(ISNA(VLOOKUP(CONCATENATE($A16,$A$4),Data!$A$2:$S$100,Lookup!R$3,FALSE)),\"\",VLOOKUP(CONCATENATE($A16,$A$4),Data!$A$2:$S$100,Lookup!R$3,FALSE))","v":2789.31},{"$f":"IF(ISNA(VLOOKUP(CONCATENATE($A16,$A$4),Data!$A$2:$S$100,Lookup!S$3,FALSE)),\"\",VLOOKUP(CONCATENATE($A16,$A$4),Data!$A$2:$S$100,Lookup!S$3,FALSE))","v":1106.1867349141253},{"$f":"IF(ISNA(VLOOKUP(CONCATENATE($A16,$A$4),Data!$A$2:$S$100,Lookup!T$3,FALSE)),\"\",VLOOKUP(CONCATENATE($A16,$A$4),Data!$A$2:$S$100,Lookup!T$3,FALSE))","v":85.892103363822727}]
[5,{"$f":"IF(ISNA(VLOOKUP(CONCATENATE($A17,$A$4),Data!$A$2:$S$100,Lookup!C$3,FALSE)),\"\",VLOOKUP(CONCATENATE($A17,$A$4),Data!$A$2:$S$100,Lookup!C$3,FALSE))","v":"Edinburgh Royal Infirmary"},{"$f":"IF(ISNA(VLOOKUP(CONCATENATE($A17,$A$4),Data!$A$2:$S$100,Lookup!D$3,FALSE)),\"\",VLOOKUP(CONCATENATE($A17,$A$4),Data!$A$2:$S$100,Lookup!D$3,FALSE))","v":"S"},{"$f":"IF(ISNA(VLOOKUP(CONCATENATE($A17,$A$4),Data!$A$2:$S$100,Lookup!E$3,FALSE)),\"\",VLOOKUP(CONCATENATE($A17,$A$4),Data!$A$2:$S$100,Lookup!E$3,FALSE))","v":"A1"},{"$f":"IF(ISNA(VLOOKUP(CONCATENATE($A17,$A$4),Data!$A$2:$S$100,Lookup!F$3,FALSE)),\"\",VLOOKUP(CONCATENATE($A17,$A$4),Data!$A$2:$S$100,Lookup!F$3,FALSE))","v":27},{"$f":"IF(ISNA(VLOOKUP(CONCATENATE($A17,$A$4),Data!$A$2:$S$100,Lookup!G$3,FALSE)),\"\",VLOOKUP(CONCATENATE($A17,$A$4),Data!$A$2:$S$100,Lookup!G$3,FALSE))","v":784.96153846153845},{"$f":"IF(ISNA(VLOOKUP(CONCATENATE($A17,$A$4),Data!$A$2:$S$100,Lookup!H$3,FALSE)),\"\",VLOOKUP(CONCATENATE($A17,$A$4),Data!$A$2:$S$100,Lookup!H$3,FALSE))","v":29.072649572649571},{"$f":"IF(ISNA(VLOOKUP(CONCATENATE($A17,$A$4),Data!$A$2:$S$100,Lookup!I$3,FALSE)),\"\",VLOOKUP(CONCATENATE($A17,$A$4),Data!$A$2:$S$100,Lookup!I$3,FALSE))","v":112.97542851673275},{"$f":"IF(ISNA(VLOOKUP(CONCATENATE($A17,$A$4),Data!$A$2:$S$100,Lookup!J$3,FALSE)),\"\",VLOOKUP(CONCATENATE($A17,$A$4),Data!$A$2:$S$100,Lookup!J$3,FALSE))","v":11055.291999999999},{"$f":"IF(ISNA(VLOOKUP(CONCATENATE($A17,$A$4),Data!$A$2:$S$100,Lookup!K$3,FALSE)),\"\",VLOOKUP(CONCATENATE($A17,$A$4),Data!$A$2:$S$100,Lookup!K$3,FALSE))","v":11715.736000000001},{"$f":"IF(ISNA(VLOOKUP(CONCATENATE($A17,$A$4),Data!$A$2:$S$100,Lookup!L$3,FALSE)),\"\",VLOOKUP(CONCATENATE($A17,$A$4),Data!$A$2:$S$100,Lookup!L$3,FALSE))","v":3737.7339999999999},{"$f":"IF(ISNA(VLOOKUP(CONCATENATE($A17,$A$4),Data!$A$2:$S$100,Lookup!M$3,FALSE)),\"\",VLOOKUP(CONCATENATE($A17,$A$4),Data!$A$2:$S$100,Lookup!M$3,FALSE))","v":1492.2909999999999},{"$f":"IF(ISNA(VLOOKUP(CONCATENATE($A17,$A$4),Data!$A$2:$S$100,Lookup!N$3,FALSE)),\"\",VLOOKUP(CONCATENATE($A17,$A$4),Data!$A$2:$S$100,Lookup!N$3,FALSE))","v":2445.0390000000002},{"$f":"IF(ISNA(VLOOKUP(CONCATENATE($A17,$A$4),Data!$A$2:$S$100,Lookup!O$3,FALSE)),\"\",VLOOKUP(CONCATENATE($A17,$A$4),Data!$A$2:$S$100,Lookup!O$3,FALSE))","v":18926.703000000001},{"$f":"IF(ISNA(VLOOKUP(CONCATENATE($A17,$A$4),Data!$A$2:$S$100,Lookup!P$3,FALSE)),\"\",VLOOKUP(CONCATENATE($A17,$A$4),Data!$A$2:$S$100,Lookup!P$3,FALSE))","v":1419.5920000000001},{"$f":"IF(ISNA(VLOOKUP(CONCATENATE($A17,$A$4),Data!$A$2:$S$100,Lookup!Q$3,FALSE)),\"\",VLOOKUP(CONCATENATE($A17,$A$4),Data!$A$2:$S$100,Lookup!Q$3,FALSE))","v":50792.387000000002},{"$f":"IF(ISNA(VLOOKUP(CONCATENATE($A17,$A$4),Data!$A$2:$S$100,Lookup!R$3,FALSE)),\"\",VLOOKUP(CONCATENATE($A17,$A$4),Data!$A$2:$S$100,Lookup!R$3,FALSE))","v":"-"},{"$f":"IF(ISNA(VLOOKUP(CONCATENATE($A17,$A$4),Data!$A$2:$S$100,Lookup!S$3,FALSE)),\"\",VLOOKUP(CONCATENATE($A17,$A$4),Data!$A$2:$S$100,Lookup!S$3,FALSE))","v":1244.3624626390317},{"$f":"IF(ISNA(VLOOKUP(CONCATENATE($A17,$A$4),Data!$A$2:$S$100,Lookup!T$3,FALSE)),\"\",VLOOKUP(CONCATENATE($A17,$A$4),Data!$A$2:$S$100,Lookup!T$3,FALSE))","v":96.62103683728408}]
[6,{"$f":"IF(ISNA(VLOOKUP(CONCATENATE($A18,$A$4),Data!$A$2:$S$100,Lookup!C$3,FALSE)),\"\",VLOOKUP(CONCATENATE($A18,$A$4),Data!$A$2:$S$100,Lookup!C$3,FALSE))","v":"Ninewells"},{"$f":"IF(ISNA(VLOOKUP(CONCATENATE($A18,$A$4),Data!$A$2:$S$100,Lookup!D$3,FALSE)),\"\",VLOOKUP(CONCATENATE($A18,$A$4),Data!$A$2:$S$100,Lookup!D$3,FALSE))","v":"T"},{"$f":"IF(ISNA(VLOOKUP(CONCATENATE($A18,$A$4),Data!$A$2:$S$100,Lookup!E$3,FALSE)),\"\",VLOOKUP(CONCATENATE($A18,$A$4),Data!$A$2:$S$100,Lookup!E$3,FALSE))","v":"A1"},{"$f":"IF(ISNA(VLOOKUP(CONCATENATE($A18,$A$4),Data!$A$2:$S$100,Lookup!F$3,FALSE)),\"\",VLOOKUP(CONCATENATE($A18,$A$4),Data!$A$2:$S$100,Lookup!F$3,FALSE))","v":18},{"$f":"IF(ISNA(VLOOKUP(CONCATENATE($A18,$A$4),Data!$A$2:$S$100,Lookup!G$3,FALSE)),\"\",VLOOKUP(CONCATENATE($A18,$A$4),Data!$A$2:$S$100,Lookup!G$3,FALSE))","v":613.24692307692305},{"$f":"IF(ISNA(VLOOKUP(CONCATENATE($A18,$A$4),Data!$A$2:$S$100,Lookup!H$3,FALSE)),\"\",VLOOKUP(CONCATENATE($A18,$A$4),Data!$A$2:$S$100,Lookup!H$3,FALSE))","v":34.069273504273504},{"$f":"IF(ISNA(VLOOKUP(CONCATENATE($A18,$A$4),Data!$A$2:$S$100,Lookup!I$3,FALSE)),\"\",VLOOKUP(CONCATENATE($A18,$A$4),Data!$A$2:$S$100,Lookup!I$3,FALSE))","v":132.3921565449628},{"$f":"IF(ISNA(VLOOKUP(CONCATENATE($A18,$A$4),Data!$A$2:$S$100,Lookup!J$3,FALSE)),\"\",VLOOKUP(CONCATENATE($A18,$A$4),Data!$A$2:$S$100,Lookup!J$3,FALSE))","v":10252.469499999999},{"$f":"IF(ISNA(VLOOKUP(CONCATENATE($A18,$A$4),Data!$A$2:$S$100,Lookup!K$3,FALSE)),\"\",VLOOKUP(CONCATENATE($A18,$A$4),Data!$A$2:$S$100,Lookup!K$3,FALSE))","v":10952.9897},{"$f":"IF(ISNA(VLOOKUP(CONCATENATE($A18,$A$4),Data!$A$2:$S$100,Lookup!L$3,FALSE)),\"\",VLOOKUP(CONCATENATE($A18,$A$4),Data!$A$2:$S$100,Lookup!L$3,FALSE))","v":1287.46795},{"$f":"IF(ISNA(VLOOKUP(CONCATENATE($A18,$A$4),Data!$A$2:$S$100,Lookup!M$3,FALSE)),\"\",VLOOKUP(CONCATENATE($A18,$A$4),Data!$A$2:$S$100,Lookup!M$3,FALSE))","v":927.56191999999999},{"$f":"IF(ISNA(VLOOKUP(CONCATENATE($A18,$A$4),Data!$A$2:$S$100,Lookup!N$3,FALSE)),\"\",VLOOKUP(CONCATENATE($A18,$A$4),Data!$A$2:$S$100,Lookup!N$3,FALSE))","v":2071.6816800000001},{"$f":"IF(ISNA(VLOOKUP(CONCATENATE($A18,$A$4),Data!$A$2:$S$100,Lookup!O$3,FALSE)),\"\",VLOOKUP(CONCATENATE($A18,$A$4),Data!$A$2:$S$100,Lookup!O$3,FALSE))","v":7374.4057899999998},{"$f":"IF(ISNA(VLOOKUP(CONCATENATE($A18,$A$4),Data!$A$2:$S$100,Lookup!P$3,FALSE)),\"\",VLOOKUP(CONCATENATE($A18,$A$4),Data!$A$2:$S$100,Lookup!P$3,FALSE))","v":15595.303},{"$f":"IF(ISNA(VLOOKUP(CONCATENATE($A18,$A$4),Data!$A$2:$S$100,Lookup!Q$3,FALSE)),\"\",VLOOKUP(CONCATENATE($A18,$A$4),Data!$A$2:$S$100,Lookup!Q$3,FALSE))","v":48461.879540000002},{"$f":"IF(ISNA(VLOOKUP(CONCATENATE($A18,$A$4),Data!$A$2:$S$100,Lookup!R$3,FALSE)),\"\",VLOOKUP(CONCATENATE($A18,$A$4),Data!$A$2:$S$100,Lookup!R$3,FALSE))","v":"-"},{"$f":"IF(ISNA(VLOOKUP(CONCATENATE($A18,$A$4),Data!$A$2:$S$100,Lookup!S$3,FALSE)),\"\",VLOOKUP(CONCATENATE($A18,$A$4),Data!$A$2:$S$100,Lookup!S$3,FALSE))","v":1519.712838096337},{"$f":"IF(ISNA(VLOOKUP(CONCATENATE($A18,$A$4),Data!$A$2:$S$100,Lookup!T$3,FALSE)),\"\",VLOOKUP(CONCATENATE($A18,$A$4),Data!$A$2:$S$100,Lookup!T$3,FALSE))","v":118.00117290615701}]
[7,{"$f":"IF(ISNA(VLOOKUP(CONCATENATE($A19,$A$4),Data!$A$2:$S$100,Lookup!C$3,FALSE)),\"\",VLOOKUP(CONCATENATE($A19,$A$4),Data!$A$2:$S$100,Lookup!C$3,FALSE))","v":"Aberdeen Royal Infirmary"},{"$f":"IF(ISNA(VLOOKUP(CONCATENATE($A19,$A$4),Data!$A$2:$S$100,Lookup!D$3,FALSE)),\"\",VLOOKUP(CONCATENATE($A19,$A$4),Data!$A$2:$S$100,Lookup!D$3,FALSE))","v":"N"},{"$f":"IF(ISNA(VLOOKUP(CONCATENATE($A19,$A$4),Data!$A$2:$S$100,Lookup!E$3,FALSE)),\"\",VLOOKUP(CONCATENATE($A19,$A$4),Data!$A$2:$S$100,Lookup!E$3,FALSE))","v":"A1"},{"$f":"IF(ISNA(VLOOKUP(CONCATENATE($A19,$A$4),Data!$A$2:$S$100,Lookup!F$3,FALSE)),\"\",VLOOKUP(CONCATENATE($A19,$A$4),Data!$A$2:$S$100,Lookup!F$3,FALSE))","v":25},{"$f":"IF(ISNA(VLOOKUP(CONCATENATE($A19,$A$4),Data!$A$2:$S$100,Lookup!G$3,FALSE)),\"\",VLOOKUP(CONCATENATE($A19,$A$4),Data!$A$2:$S$100,Lookup!G$3,FALSE))","v":494.48076923076923},{"$f":"IF(ISNA(VLOOKUP(CONCATENATE($A19,$A$4),Data!$A$2:$S$100,Lookup!H$3,FALSE)),\"\",VLOOKUP(CONCATENATE($A19,$A$4),Data!$A$2:$S$100,Lookup!H$3,FALSE))","v":19.779230769230768},{"$f":"IF(ISNA(VLOOKUP(CONCATENATE($A19,$A$4),Data!$A$2:$S$100,Lookup!I$3,FALSE)),\"\",VLOOKUP(CONCATENATE($A19,$A$4),Data!$A$2:$S$100,Lookup!I$3,FALSE))","v":76.861486817747277},{"$f":"IF(ISNA(VLOOKUP(CONCATENATE($A19,$A$4),Data!$A$2:$S$100,Lookup!J$3,FALSE)),\"\",VLOOKUP(CONCATENATE($A19,$A$4),Data!$A$2:$S$100,Lookup!J$3,FALSE))","v":10862.116},{"$f":"IF(ISNA(VLOOKUP(CONCATENATE($A19,$A$4),Data!$A$2:$S$100,Lookup!K$3,FALSE)),\"\",VLOOKUP(CONCATENATE($A19,$A$4),Data!$A$2:$S$100,Lookup!K$3,FALSE))","v":12012.795},{"$f":"IF(ISNA(VLOOKUP(CONCATENATE($A19,$A$4),Data!$A$2:$S$100,Lookup!L$3,FALSE)),\"\",VLOOKUP(CONCATENATE($A19,$A$4),Data!$A$2:$S$100,Lookup!L$3,FALSE))","v":995.58500000000004},{"$f":"IF(ISNA(VLOOKUP(CONCATENATE($A19,$A$4),Data!$A$2:$S$100,Lookup!M$3,FALSE)),\"\",VLOOKUP(CONCATENATE($A19,$A$4),Data!$A$2:$S$100,Lookup!M$3,FALSE))","v":1250.76},{"$f":"IF(ISNA(VLOOKUP(CONCATENATE($A19,$A$4),Data!$A$2:$S$100,Lookup!N$3,FALSE)),\"\",VLOOKUP(CONCATENATE($A19,$A$4),Data!$A$2:$S$100,Lookup!N$3,FALSE))","v":286.79000000000002},{"$f":"IF(ISNA(VLOOKUP(CONCATENATE($A19,$A$4),Data!$A$2:$S$100,Lookup!O$3,FALSE)),\"\",VLOOKUP(CONCATENATE($A19,$A$4),Data!$A$2:$S$100,Lookup!O$3,FALSE))","v":11334.467000000001},{"$f":"IF(ISNA(VLOOKUP(CONCATENATE($A19,$A$4),Data!$A$2:$S$100,Lookup!P$3,FALSE)),\"\",VLOOKUP(CONCATENATE($A19,$A$4),Data!$A$2:$S$100,Lookup!P$3,FALSE))","v":7348.5029999999997},{"$f":"IF(ISNA(VLOOKUP(CONCATENATE($A19,$A$4),Data!$A$2:$S$100,Lookup!Q$3,FALSE)),\"\",VLOOKUP(CONCATENATE($A19,$A$4),Data!$A$2:$S$100,Lookup!Q$3,FALSE))","v":44091.016000000003},{"$f":"IF(ISNA(VLOOKUP(CONCATENATE($A19,$A$4),Data!$A$2:$S$100,Lookup!R$3,FALSE)),\"\",VLOOKUP(CONCATENATE($A19,$A$4),Data!$A$2:$S$100,Lookup!R$3,FALSE))","v":"-"},{"$f":"IF(ISNA(VLOOKUP(CONCATENATE($A19,$A$4),Data!$A$2:$S$100,Lookup!S$3,FALSE)),\"\",VLOOKUP(CONCATENATE($A19,$A$4),Data!$A$2:$S$100,Lookup!S$3,FALSE))","v":1714.7363590401742},{"$f":"IF(ISNA(VLOOKUP(CONCATENATE($A19,$A$4),Data!$A$2:$S$100,Lookup!T$3,FALSE)),\"\",VLOOKUP(CONCATENATE($A19,$A$4),Data!$A$2:$S$100,Lookup!T$3,FALSE))","v":133.14416810812452}]
[8,{"$f":"IF(ISNA(VLOOKUP(CONCATENATE($A20,$A$4),Data!$A$2:$S$100,Lookup!C$3,FALSE)),\"\",VLOOKUP(CONCATENATE($A20,$A$4),Data!$A$2:$S$100,Lookup!C$3,FALSE))","v":"Western General, Edinburgh"},{"$f":"IF(ISNA(VLOOKUP(CONCATENATE($A20,$A$4),Data!$A$2:$S$100,Lookup!D$3,FALSE)),\"\",VLOOKUP(CONCATENATE($A20,$A$4),Data!$A$2:$S$100,Lookup!D$3,FALSE))","v":"S"},{"$f":"IF(ISNA(VLOOKUP(CONCATENATE($A20,$A$4),Data!$A$2:$S$100,Lookup!E$3,FALSE)),\"\",VLOOKUP(CONCATENATE($A20,$A$4),Data!$A$2:$S$100,Lookup!E$3,FALSE))","v":"A1"},{"$f":"IF(ISNA(VLOOKUP(CONCATENATE($A20,$A$4),Data!$A$2:$S$100,Lookup!F$3,FALSE)),\"\",VLOOKUP(CONCATENATE($A20,$A$4),Data!$A$2:$S$100,Lookup!F$3,FALSE))","v":11},{"$f":"IF(ISNA(VLOOKUP(CONCATENATE($A20,$A$4),Data!$A$2:$S$100,Lookup!G$3,FALSE)),\"\",VLOOKUP(CONCATENATE($A20,$A$4),Data!$A$2:$S$100,Lookup!G$3,FALSE))","v":325.03846153846155},{"$f":"IF(ISNA(VLOOKUP(CONCATENATE($A20,$A$4),Data!$A$2:$S$100,Lookup!H$3,FALSE)),\"\",VLOOKUP(CONCATENATE($A20,$A$4),Data!$A$2:$S$100,Lookup!H$3,FALSE))","v":29.54895104895105},{"$f":"IF(ISNA(VLOOKUP(CONCATENATE($A20,$A$4),Data!$A$2:$S$100,Lookup!I$3,FALSE)),\"\",VLOOKUP(CONCATENATE($A20,$A$4),Data!$A$2:$S$100,Lookup!I$3,FALSE))","v":114.82632150995119},{"$f":"IF(ISNA(VLOOKUP(CONCATENATE($A20,$A$4),Data!$A$2:$S$100,Lookup!J$3,FALSE)),\"\",VLOOKUP(CONCATENATE($A20,$A$4),Data!$A$2:$S$100,Lookup!J$3,FALSE))","v":5655.6019999999999},{"$f":"IF(ISNA(VLOOKUP(CONCATENATE($A20,$A$4),Data!$A$2:$S$100,Lookup!K$3,FALSE)),\"\",VLOOKUP(CONCATENATE($A20,$A$4),Data!$A$2:$S$100,Lookup!K$3,FALSE))","v":5994.5050000000001},{"$f":"IF(ISNA(VLOOKUP(CONCATENATE($A20,$A$4),Data!$A$2:$S$100,Lookup!L$3,FALSE)),\"\",VLOOKUP(CONCATENATE($A20,$A$4),Data!$A$2:$S$100,Lookup!L$3,FALSE))","v":1205.557},{"$f":"IF(ISNA(VLOOKUP(CONCATENATE($A20,$A$4),Data!$A$2:$S$100,Lookup!M$3,FALSE)),\"\",VLOOKUP(CONCATENATE($A20,$A$4),Data!$A$2:$S$100,Lookup!M$3,FALSE))","v":631.31899999999996},{"$f":"IF(ISNA(VLOOKUP(CONCATENATE($A20,$A$4),Data!$A$2:$S$100,Lookup!N$3,FALSE)),\"\",VLOOKUP(CONCATENATE($A20,$A$4),Data!$A$2:$S$100,Lookup!N$3,FALSE))","v":698.53800000000001},{"$f":"IF(ISNA(VLOOKUP(CONCATENATE($A20,$A$4),Data!$A$2:$S$100,Lookup!O$3,FALSE)),\"\",VLOOKUP(CONCATENATE($A20,$A$4),Data!$A$2:$S$100,Lookup!O$3,FALSE))","v":6602.2070000000003},{"$f":"IF(ISNA(VLOOKUP(CONCATENATE($A20,$A$4),Data!$A$2:$S$100,Lookup!P$3,FALSE)),\"\",VLOOKUP(CONCATENATE($A20,$A$4),Data!$A$2:$S$100,Lookup!P$3,FALSE))","v":683.57799999999997},{"$f":"IF(ISNA(VLOOKUP(CONCATENATE($A20,$A$4),Data!$A$2:$S$100,Lookup!Q$3,FALSE)),\"\",VLOOKUP(CONCATENATE($A20,$A$4),Data!$A$2:$S$100,Lookup!Q$3,FALSE))","v":21471.306},{"$f":"IF(ISNA(VLOOKUP(CONCATENATE($A20,$A$4),Data!$A$2:$S$100,Lookup!R$3,FALSE)),\"\",VLOOKUP(CONCATENATE($A20,$A$4),Data!$A$2:$S$100,Lookup!R$3,FALSE))","v":"-"},{"$f":"IF(ISNA(VLOOKUP(CONCATENATE($A20,$A$4),Data!$A$2:$S$100,Lookup!S$3,FALSE)),\"\",VLOOKUP(CONCATENATE($A20,$A$4),Data!$A$2:$S$100,Lookup!S$3,FALSE))","v":1270.3411430599929},{"$f":"IF(ISNA(VLOOKUP(CONCATENATE($A20,$A$4),Data!$A$2:$S$100,Lookup!T$3,FALSE)),\"\",VLOOKUP(CONCATENATE($A20,$A$4),Data!$A$2:$S$100,Lookup!T$3,FALSE))","v":98.638203951610521}]
[9,{"$f":"IF(ISNA(VLOOKUP(CONCATENATE($A21,$A$4),Data!$A$2:$S$100,Lookup!C$3,FALSE)),\"\",VLOOKUP(CONCATENATE($A21,$A$4),Data!$A$2:$S$100,Lookup!C$3,FALSE))","v":"West Hospitals"},{"$f":"IF(ISNA(VLOOKUP(CONCATENATE($A21,$A$4),Data!$A$2:$S$100,Lookup!D$3,FALSE)),\"\",VLOOKUP(CONCATENATE($A21,$A$4),Data!$A$2:$S$100,Lookup!D$3,FALSE))","v":"G"},{"$f":"IF(ISNA(VLOOKUP(CONCATENATE($A21,$A$4),Data!$A$2:$S$100,Lookup!E$3,FALSE)),\"\",VLOOKUP(CONCATENATE($A21,$A$4),Data!$A$2:$S$100,Lookup!E$3,FALSE))","v":"A1"},{"$f":"IF(ISNA(VLOOKUP(CONCATENATE($A21,$A$4),Data!$A$2:$S$100,Lookup!F$3,FALSE)),\"\",VLOOKUP(CONCATENATE($A21,$A$4),Data!$A$2:$S$100,Lookup!F$3,FALSE))","v":11},{"$f":"IF(ISNA(VLOOKUP(CONCATENATE($A21,$A$4),Data!$A$2:$S$100,Lookup!G$3,FALSE)),\"\",VLOOKUP(CONCATENATE($A21,$A$4),Data!$A$2:$S$100,Lookup!G$3,FALSE))","v":165.96153846153845},{"$f":"IF(ISNA(VLOOKUP(CONCATENATE($A21,$A$4),Data!$A$2:$S$100,Lookup!H$3,FALSE)),\"\",VLOOKUP(CONCATENATE($A21,$A$4),Data!$A$2:$S$100,Lookup!H$3,FALSE))","v":15.087412587412587},{"$f":"IF(ISNA(VLOOKUP(CONCATENATE($A21,$A$4),Data!$A$2:$S$100,Lookup!I$3,FALSE)),\"\",VLOOKUP(CONCATENATE($A21,$A$4),Data!$A$2:$S$100,Lookup!I$3,FALSE))","v":58.629224626131723},{"$f":"IF(ISNA(VLOOKUP(CONCATENATE($A21,$A$4),Data!$A$2:$S$100,Lookup!J$3,FALSE)),\"\",VLOOKUP(CONCATENATE($A21,$A$4),Data!$A$2:$S$100,Lookup!J$3,FALSE))","v":2359.2869999999998},{"$f":"IF(ISNA(VLOOKUP(CONCATENATE($A21,$A$4),Data!$A$2:$S$100,Lookup!K$3,FALSE)),\"\",VLOOKUP(CONCATENATE($A21,$A$4),Data!$A$2:$S$100,Lookup!K$3,FALSE))","v":4103.415},{"$f":"IF(ISNA(VLOOKUP(CONCATENATE($A21,$A$4),Data!$A$2:$S$100,Lookup!L$3,FALSE)),\"\",VLOOKUP(CONCATENATE($A21,$A$4),Data!$A$2:$S$100,Lookup!L$3,FALSE))","v":10.031000000000001},{"$f":"IF(ISNA(VLOOKUP(CONCATENATE($A21,$A$4),Data!$A$2:$S$100,Lookup!M$3,FALSE)),\"\",VLOOKUP(CONCATENATE($A21,$A$4),Data!$A$2:$S$100,Lookup!M$3,FALSE))","v":459.084},{"$f":"IF(ISNA(VLOOKUP(CONCATENATE($A21,$A$4),Data!$A$2:$S$100,Lookup!N$3,FALSE)),\"\",VLOOKUP(CONCATENATE($A21,$A$4),Data!$A$2:$S$100,Lookup!N$3,FALSE))","v":0.28599999999999998},{"$f":"IF(ISNA(VLOOKUP(CONCATENATE($A21,$A$4),Data!$A$2:$S$100,Lookup!O$3,FALSE)),\"\",VLOOKUP(CONCATENATE($A21,$A$4),Data!$A$2:$S$100,Lookup!O$3,FALSE))","v":2517.9209999999998},{"$f":"IF(ISNA(VLOOKUP(CONCATENATE($A21,$A$4),Data!$A$2:$S$100,Lookup!P$3,FALSE)),\"\",VLOOKUP(CONCATENATE($A21,$A$4),Data!$A$2:$S$100,Lookup!P$3,FALSE))","v":3450.623},{"$f":"IF(ISNA(VLOOKUP(CONCATENATE($A21,$A$4),Data!$A$2:$S$100,Lookup!Q$3,FALSE)),\"\",VLOOKUP(CONCATENATE($A21,$A$4),Data!$A$2:$S$100,Lookup!Q$3,FALSE))","v":12900.647000000001},{"$f":"IF(ISNA(VLOOKUP(CONCATENATE($A21,$A$4),Data!$A$2:$S$100,Lookup!R$3,FALSE)),\"\",VLOOKUP(CONCATENATE($A21,$A$4),Data!$A$2:$S$100,Lookup!R$3,FALSE))","v":917.05600000000004},{"$f":"IF(ISNA(VLOOKUP(CONCATENATE($A21,$A$4),Data!$A$2:$S$100,Lookup!S$3,FALSE)),\"\",VLOOKUP(CONCATENATE($A21,$A$4),Data!$A$2:$S$100,Lookup!S$3,FALSE))","v":1494.8606025492468},{"$f":"IF(ISNA(VLOOKUP(CONCATENATE($A21,$A$4),Data!$A$2:$S$100,Lookup!T$3,FALSE)),\"\",VLOOKUP(CONCATENATE($A21,$A$4),Data!$A$2:$S$100,Lookup!T$3,FALSE))","v":116.07147087931209}]
[10,{"$f":"IF(ISNA(VLOOKUP(CONCATENATE($A22,$A$4),Data!$A$2:$S$100,Lookup!C$3,FALSE)),\"\",VLOOKUP(CONCATENATE($A22,$A$4),Data!$A$2:$S$100,Lookup!C$3,FALSE))","v":"Forth Valley Royal Hospital"},{"$f":"IF(ISNA(VLOOKUP(CONCATENATE($A22,$A$4),Data!$A$2:$S$100,Lookup!D$3,FALSE)),\"\",VLOOKUP(CONCATENATE($A22,$A$4),Data!$A$2:$S$100,Lookup!D$3,FALSE))","v":"V"},{"$f":"IF(ISNA(VLOOKUP(CONCATENATE($A22,$A$4),Data!$A$2:$S$100,Lookup!E$3,FALSE)),\"\",VLOOKUP(CONCATENATE($A22,$A$4),Data!$A$2:$S$100,Lookup!E$3,FALSE))","v":"A2"},{"$f":"IF(ISNA(VLOOKUP(CONCATENATE($A22,$A$4),Data!$A$2:$S$100,Lookup!F$3,FALSE)),\"\",VLOOKUP(CONCATENATE($A22,$A$4),Data!$A$2:$S$100,Lookup!F$3,FALSE))","v":14.81},{"$f":"IF(ISNA(VLOOKUP(CONCATENATE($A22,$A$4),Data!$A$2:$S$100,Lookup!G$3,FALSE)),\"\",VLOOKUP(CONCATENATE($A22,$A$4),Data!$A$2:$S$100,Lookup!G$3,FALSE))","v":364.70692307692303},{"$f":"IF(ISNA(VLOOKUP(CONCATENATE($A22,$A$4),Data!$A$2:$S$100,Lookup!H$3,FALSE)),\"\",VLOOKUP(CONCATENATE($A22,$A$4),Data!$A$2:$S$100,Lookup!H$3,FALSE))","v":24.62572066690905},{"$f":"IF(ISNA(VLOOKUP(CONCATENATE($A22,$A$4),Data!$A$2:$S$100,Lookup!I$3,FALSE)),\"\",VLOOKUP(CONCATENATE($A22,$A$4),Data!$A$2:$S$100,Lookup!I$3,FALSE))","v":95.694798574351665},{"$f":"IF(ISNA(VLOOKUP(CONCATENATE($A22,$A$4),Data!$A$2:$S$100,Lookup!J$3,FALSE)),\"\",VLOOKUP(CONCATENATE($A22,$A$4),Data!$A$2:$S$100,Lookup!J$3,FALSE))","v":5659.80242},{"$f":"IF(ISNA(VLOOKUP(CONCATENATE($A22,$A$4),Data!$A$2:$S$100,Lookup!K$3,FALSE)),\"\",VLOOKUP(CONCATENATE($A22,$A$4),Data!$A$2:$S$100,Lookup!K$3,FALSE))","v":4105.0776000000005},{"$f":"IF(ISNA(VLOOKUP(CONCATENATE($A22,$A$4),Data!$A$2:$S$100,Lookup!L$3,FALSE)),\"\",VLOOKUP(CONCATENATE($A22,$A$4),Data!$A$2:$S$100,Lookup!L$3,FALSE))","v":710.07154000000003},{"$f":"IF(ISNA(VLOOKUP(CONCATENATE($A22,$A$4),Data!$A$2:$S$100,Lookup!M$3,FALSE)),\"\",VLOOKUP(CONCATENATE($A22,$A$4),Data!$A$2:$S$100,Lookup!M$3,FALSE))","v":317.72953999999999},{"$f":"IF(ISNA(VLOOKUP(CONCATENATE($A22,$A$4),Data!$A$2:$S$100,Lookup!N$3,FALSE)),\"\",VLOOKUP(CONCATENATE($A22,$A$4),Data!$A$2:$S$100,Lookup!N$3,FALSE))","v":3956.4937799999998},{"$f":"IF(ISNA(VLOOKUP(CONCATENATE($A22,$A$4),Data!$A$2:$S$100,Lookup!O$3,FALSE)),\"\",VLOOKUP(CONCATENATE($A22,$A$4),Data!$A$2:$S$100,Lookup!O$3,FALSE))","v":220.85895000000002},{"$f":"IF(ISNA(VLOOKUP(CONCATENATE($A22,$A$4),Data!$A$2:$S$100,Lookup!P$3,FALSE)),\"\",VLOOKUP(CONCATENATE($A22,$A$4),Data!$A$2:$S$100,Lookup!P$3,FALSE))","v":5147.5367000000006},{"$f":"IF(ISNA(VLOOKUP(CONCATENATE($A22,$A$4),Data!$A$2:$S$100,Lookup!Q$3,FALSE)),\"\",VLOOKUP(CONCATENATE($A22,$A$4),Data!$A$2:$S$100,Lookup!Q$3,FALSE))","v":20117.570530000001},{"$f":"IF(ISNA(VLOOKUP(CONCATENATE($A22,$A$4),Data!$A$2:$S$100,Lookup!R$3,FALSE)),\"\",VLOOKUP(CONCATENATE($A22,$A$4),Data!$A$2:$S$100,Lookup!R$3,FALSE))","v":"-"},{"$f":"IF(ISNA(VLOOKUP(CONCATENATE($A22,$A$4),Data!$A$2:$S$100,Lookup!S$3,FALSE)),\"\",VLOOKUP(CONCATENATE($A22,$A$4),Data!$A$2:$S$100,Lookup!S$3,FALSE))","v":1060.7869822766015},{"$f":"IF(ISNA(VLOOKUP(CONCATENATE($A22,$A$4),Data!$A$2:$S$100,Lookup!T$3,FALSE)),\"\",VLOOKUP(CONCATENATE($A22,$A$4),Data!$A$2:$S$100,Lookup!T$3,FALSE))","v":82.366947869586127}]
[11,{"$f":"IF(ISNA(VLOOKUP(CONCATENATE($A23,$A$4),Data!$A$2:$S$100,Lookup!C$3,FALSE)),\"\",VLOOKUP(CONCATENATE($A23,$A$4),Data!$A$2:$S$100,Lookup!C$3,FALSE))","v":"Royal Alexandra Hospital"},{"$f":"IF(ISNA(VLOOKUP(CONCATENATE($A23,$A$4),Data!$A$2:$S$100,Lookup!D$3,FALSE)),\"\",VLOOKUP(CONCATENATE($A23,$A$4),Data!$A$2:$S$100,Lookup!D$3,FALSE))","v":"G"},{"$f":"IF(ISNA(VLOOKUP(CONCATENATE($A23,$A$4),Data!$A$2:$S$100,Lookup!E$3,FALSE)),\"\",VLOOKUP(CONCATENATE($A23,$A$4),Data!$A$2:$S$100,Lookup!E$3,FALSE))","v":"A2"},{"$f":"IF(ISNA(VLOOKUP(CONCATENATE($A23,$A$4),Data!$A$2:$S$100,Lookup!F$3,FALSE)),\"\",VLOOKUP(CONCATENATE($A23,$A$4),Data!$A$2:$S$100,Lookup!F$3,FALSE))","v":12},{"$f":"IF(ISNA(VLOOKUP(CONCATENATE($A23,$A$4),Data!$A$2:$S$100,Lookup!G$3,FALSE)),\"\",VLOOKUP(CONCATENATE($A23,$A$4),Data!$A$2:$S$100,Lookup!G$3,FALSE))","v":296.21153846153845},{"$f":"IF(ISNA(VLOOKUP(CONCATENATE($A23,$A$4),Data!$A$2:$S$100,Lookup!H$3,FALSE)),\"\",VLOOKUP(CONCATENATE($A23,$A$4),Data!$A$2:$S$100,Lookup!H$3,FALSE))","v":24.684294871794872},{"$f":"IF(ISNA(VLOOKUP(CONCATENATE($A23,$A$4),Data!$A$2:$S$100,Lookup!I$3,FALSE)),\"\",VLOOKUP(CONCATENATE($A23,$A$4),Data!$A$2:$S$100,Lookup!I$3,FALSE))","v":95.922416145996309},{"$f":"IF(ISNA(VLOOKUP(CONCATENATE($A23,$A$4),Data!$A$2:$S$100,Lookup!J$3,FALSE)),\"\",VLOOKUP(CONCATENATE($A23,$A$4),Data!$A$2:$S$100,Lookup!J$3,FALSE))","v":5591.3119999999999},{"$f":"IF(ISNA(VLOOKUP(CONCATENATE($A23,$A$4),Data!$A$2:$S$100,Lookup!K$3,FALSE)),\"\",VLOOKUP(CONCATENATE($A23,$A$4),Data!$A$2:$S$100,Lookup!K$3,FALSE))","v":7239.3819999999996},{"$f":"IF(ISNA(VLOOKUP(CONCATENATE($A23,$A$4),Data!$A$2:$S$100,Lookup!L$3,FALSE)),\"\",VLOOKUP(CONCATENATE($A23,$A$4),Data!$A$2:$S$100,Lookup!L$3,FALSE))","v":25.762},{"$f":"IF(ISNA(VLOOKUP(CONCATENATE($A23,$A$4),Data!$A$2:$S$100,Lookup!M$3,FALSE)),\"\",VLOOKUP(CONCATENATE($A23,$A$4),Data!$A$2:$S$100,Lookup!M$3,FALSE))","v":622.495},{"$f":"IF(ISNA(VLOOKUP(CONCATENATE($A23,$A$4),Data!$A$2:$S$100,Lookup!N$3,FALSE)),\"\",VLOOKUP(CONCATENATE($A23,$A$4),Data!$A$2:$S$100,Lookup!N$3,FALSE))","v":192.77799999999999},{"$f":"IF(ISNA(VLOOKUP(CONCATENATE($A23,$A$4),Data!$A$2:$S$100,Lookup!O$3,FALSE)),\"\",VLOOKUP(CONCATENATE($A23,$A$4),Data!$A$2:$S$100,Lookup!O$3,FALSE))","v":4550.5119999999997},{"$f":"IF(ISNA(VLOOKUP(CONCATENATE($A23,$A$4),Data!$A$2:$S$100,Lookup!P$3,FALSE)),\"\",VLOOKUP(CONCATENATE($A23,$A$4),Data!$A$2:$S$100,Lookup!P$3,FALSE))","v":3636.5050000000001},{"$f":"IF(ISNA(VLOOKUP(CONCATENATE($A23,$A$4),Data!$A$2:$S$100,Lookup!Q$3,FALSE)),\"\",VLOOKUP(CONCATENATE($A23,$A$4),Data!$A$2:$S$100,Lookup!Q$3,FALSE))","v":21858.745999999999},{"$f":"IF(ISNA(VLOOKUP(CONCATENATE($A23,$A$4),Data!$A$2:$S$100,Lookup!R$3,FALSE)),\"\",VLOOKUP(CONCATENATE($A23,$A$4),Data!$A$2:$S$100,Lookup!R$3,FALSE))","v":"-"},{"$f":"IF(ISNA(VLOOKUP(CONCATENATE($A23,$A$4),Data!$A$2:$S$100,Lookup!S$3,FALSE)),\"\",VLOOKUP(CONCATENATE($A23,$A$4),Data!$A$2:$S$100,Lookup!S$3,FALSE))","v":1419.1226384470558},{"$f":"IF(ISNA(VLOOKUP(CONCATENATE($A23,$A$4),Data!$A$2:$S$100,Lookup!T$3,FALSE)),\"\",VLOOKUP(CONCATENATE($A23,$A$4),Data!$A$2:$S$100,Lookup!T$3,FALSE))","v":110.19064367726116}]
[12,{"$f":"IF(ISNA(VLOOKUP(CONCATENATE($A24,$A$4),Data!$A$2:$S$100,Lookup!C$3,FALSE)),\"\",VLOOKUP(CONCATENATE($A24,$A$4),Data!$A$2:$S$100,Lookup!C$3,FALSE))","v":"Victoria Kirkcaldy"},{"$f":"IF(ISNA(VLOOKUP(CONCATENATE($A24,$A$4),Data!$A$2:$S$100,Lookup!D$3,FALSE)),\"\",VLOOKUP(CONCATENATE($A24,$A$4),Data!$A$2:$S$100,Lookup!D$3,FALSE))","v":"F"},{"$f":"IF(ISNA(VLOOKUP(CONCATENATE($A24,$A$4),Data!$A$2:$S$100,Lookup!E$3,FALSE)),\"\",VLOOKUP(CONCATENATE($A24,$A$4),Data!$A$2:$S$100,Lookup!E$3,FALSE))","v":"A2"},{"$f":"IF(ISNA(VLOOKUP(CONCATENATE($A24,$A$4),Data!$A$2:$S$100,Lookup!F$3,FALSE)),\"\",VLOOKUP(CONCATENATE($A24,$A$4),Data!$A$2:$S$100,Lookup!F$3,FALSE))","v":12},{"$f":"IF(ISNA(VLOOKUP(CONCATENATE($A24,$A$4),Data!$A$2:$S$100,Lookup!G$3,FALSE)),\"\",VLOOKUP(CONCATENATE($A24,$A$4),Data!$A$2:$S$100,Lookup!G$3,FALSE))","v":445.36538461538464},{"$f":"IF(ISNA(VLOOKUP(CONCATENATE($A24,$A$4),Data!$A$2:$S$100,Lookup!H$3,FALSE)),\"\",VLOOKUP(CONCATENATE($A24,$A$4),Data!$A$2:$S$100,Lookup!H$3,FALSE))","v":37.113782051282051},{"$f":"IF(ISNA(VLOOKUP(CONCATENATE($A24,$A$4),Data!$A$2:$S$100,Lookup!I$3,FALSE)),\"\",VLOOKUP(CONCATENATE($A24,$A$4),Data!$A$2:$S$100,Lookup!I$3,FALSE))","v":144.22302379569749},{"$f":"IF(ISNA(VLOOKUP(CONCATENATE($A24,$A$4),Data!$A$2:$S$100,Lookup!J$3,FALSE)),\"\",VLOOKUP(CONCATENATE($A24,$A$4),Data!$A$2:$S$100,Lookup!J$3,FALSE))","v":4806.259},{"$f":"IF(ISNA(VLOOKUP(CONCATENATE($A24,$A$4),Data!$A$2:$S$100,Lookup!K$3,FALSE)),\"\",VLOOKUP(CONCATENATE($A24,$A$4),Data!$A$2:$S$100,Lookup!K$3,FALSE))","v":4635.3829999999998},{"$f":"IF(ISNA(VLOOKUP(CONCATENATE($A24,$A$4),Data!$A$2:$S$100,Lookup!L$3,FALSE)),\"\",VLOOKUP(CONCATENATE($A24,$A$4),Data!$A$2:$S$100,Lookup!L$3,FALSE))","v":995.61900000000003},{"$f":"IF(ISNA(VLOOKUP(CONCATENATE($A24,$A$4),Data!$A$2:$S$100,Lookup!M$3,FALSE)),\"\",VLOOKUP(CONCATENATE($A24,$A$4),Data!$A$2:$S$100,Lookup!M$3,FALSE))","v":345.59199999999998},{"$f":"IF(ISNA(VLOOKUP(CONCATENATE($A24,$A$4),Data!$A$2:$S$100,Lookup!N$3,FALSE)),\"\",VLOOKUP(CONCATENATE($A24,$A$4),Data!$A$2:$S$100,Lookup!N$3,FALSE))","v":95.873000000000005},{"$f":"IF(ISNA(VLOOKUP(CONCATENATE($A24,$A$4),Data!$A$2:$S$100,Lookup!O$3,FALSE)),\"\",VLOOKUP(CONCATENATE($A24,$A$4),Data!$A$2:$S$100,Lookup!O$3,FALSE))","v":6002.3419999999996},{"$f":"IF(ISNA(VLOOKUP(CONCATENATE($A24,$A$4),Data!$A$2:$S$100,Lookup!P$3,FALSE)),\"\",VLOOKUP(CONCATENATE($A24,$A$4),Data!$A$2:$S$100,Lookup!P$3,FALSE))","v":740.30899999999997},{"$f":"IF(ISNA(VLOOKUP(CONCATENATE($A24,$A$4),Data!$A$2:$S$100,Lookup!Q$3,FALSE)),\"\",VLOOKUP(CONCATENATE($A24,$A$4),Data!$A$2:$S$100,Lookup!Q$3,FALSE))","v":17621.377},{"$f":"IF(ISNA(VLOOKUP(CONCATENATE($A24,$A$4),Data!$A$2:$S$100,Lookup!R$3,FALSE)),\"\",VLOOKUP(CONCATENATE($A24,$A$4),Data!$A$2:$S$100,Lookup!R$3,FALSE))","v":"-"},{"$f":"IF(ISNA(VLOOKUP(CONCATENATE($A24,$A$4),Data!$A$2:$S$100,Lookup!S$3,FALSE)),\"\",VLOOKUP(CONCATENATE($A24,$A$4),Data!$A$2:$S$100,Lookup!S$3,FALSE))","v":760.88678267628131},{"$f":"IF(ISNA(VLOOKUP(CONCATENATE($A24,$A$4),Data!$A$2:$S$100,Lookup!T$3,FALSE)),\"\",VLOOKUP(CONCATENATE($A24,$A$4),Data!$A$2:$S$100,Lookup!T$3,FALSE))","v":59.080591118163426}]
[13,{"$f":"IF(ISNA(VLOOKUP(CONCATENATE($A25,$A$4),Data!$A$2:$S$100,Lookup!C$3,FALSE)),\"\",VLOOKUP(CONCATENATE($A25,$A$4),Data!$A$2:$S$100,Lookup!C$3,FALSE))","v":"Wishaw General"},{"$f":"IF(ISNA(VLOOKUP(CONCATENATE($A25,$A$4),Data!$A$2:$S$100,Lookup!D$3,FALSE)),\"\",VLOOKUP(CONCATENATE($A25,$A$4),Data!$A$2:$S$100,Lookup!D$3,FALSE))","v":"L"},{"$f":"IF(ISNA(VLOOKUP(CONCATENATE($A25,$A$4),Data!$A$2:$S$100,Lookup!E$3,FALSE)),\"\",VLOOKUP(CONCATENATE($A25,$A$4),Data!$A$2:$S$100,Lookup!E$3,FALSE))","v":"A2"},{"$f":"IF(ISNA(VLOOKUP(CONCATENATE($A25,$A$4),Data!$A$2:$S$100,Lookup!F$3,FALSE)),\"\",VLOOKUP(CONCATENATE($A25,$A$4),Data!$A$2:$S$100,Lookup!F$3,FALSE))","v":12},{"$f":"IF(ISNA(VLOOKUP(CONCATENATE($A25,$A$4),Data!$A$2:$S$100,Lookup!G$3,FALSE)),\"\",VLOOKUP(CONCATENATE($A25,$A$4),Data!$A$2:$S$100,Lookup!G$3,FALSE))","v":304.73076923076923},{"$f":"IF(ISNA(VLOOKUP(CONCATENATE($A25,$A$4),Data!$A$2:$S$100,Lookup!H$3,FALSE)),\"\",VLOOKUP(CONCATENATE($A25,$A$4),Data!$A$2:$S$100,Lookup!H$3,FALSE))","v":25.39423076923077},{"$f":"IF(ISNA(VLOOKUP(CONCATENATE($A25,$A$4),Data!$A$2:$S$100,Lookup!I$3,FALSE)),\"\",VLOOKUP(CONCATENATE($A25,$A$4),Data!$A$2:$S$100,Lookup!I$3,FALSE))","v":98.681205365802612},{"$f":"IF(ISNA(VLOOKUP(CONCATENATE($A25,$A$4),Data!$A$2:$S$100,Lookup!J$3,FALSE)),\"\",VLOOKUP(CONCATENATE($A25,$A$4),Data!$A$2:$S$100,Lookup!J$3,FALSE))","v":5592.7640000000001},{"$f":"IF(ISNA(VLOOKUP(CONCATENATE($A25,$A$4),Data!$A$2:$S$100,Lookup!K$3,FALSE)),\"\",VLOOKUP(CONCATENATE($A25,$A$4),Data!$A$2:$S$100,Lookup!K$3,FALSE))","v":6229.8320000000003},{"$f":"IF(ISNA(VLOOKUP(CONCATENATE($A25,$A$4),Data!$A$2:$S$100,Lookup!L$3,FALSE)),\"\",VLOOKUP(CONCATENATE($A25,$A$4),Data!$A$2:$S$100,Lookup!L$3,FALSE))","v":266.774},{"$f":"IF(ISNA(VLOOKUP(CONCATENATE($A25,$A$4),Data!$A$2:$S$100,Lookup!M$3,FALSE)),\"\",VLOOKUP(CONCATENATE($A25,$A$4),Data!$A$2:$S$100,Lookup!M$3,FALSE))","v":453.76400000000001},{"$f":"IF(ISNA(VLOOKUP(CONCATENATE($A25,$A$4),Data!$A$2:$S$100,Lookup!N$3,FALSE)),\"\",VLOOKUP(CONCATENATE($A25,$A$4),Data!$A$2:$S$100,Lookup!N$3,FALSE))","v":139.374},{"$f":"IF(ISNA(VLOOKUP(CONCATENATE($A25,$A$4),Data!$A$2:$S$100,Lookup!O$3,FALSE)),\"\",VLOOKUP(CONCATENATE($A25,$A$4),Data!$A$2:$S$100,Lookup!O$3,FALSE))","v":5123.1220000000003},{"$f":"IF(ISNA(VLOOKUP(CONCATENATE($A25,$A$4),Data!$A$2:$S$100,Lookup!P$3,FALSE)),\"\",VLOOKUP(CONCATENATE($A25,$A$4),Data!$A$2:$S$100,Lookup!P$3,FALSE))","v":4937.6009999999997},{"$f":"IF(ISNA(VLOOKUP(CONCATENATE($A25,$A$4),Data!$A$2:$S$100,Lookup!Q$3,FALSE)),\"\",VLOOKUP(CONCATENATE($A25,$A$4),Data!$A$2:$S$100,Lookup!Q$3,FALSE))","v":22743.231},{"$f":"IF(ISNA(VLOOKUP(CONCATENATE($A25,$A$4),Data!$A$2:$S$100,Lookup!R$3,FALSE)),\"\",VLOOKUP(CONCATENATE($A25,$A$4),Data!$A$2:$S$100,Lookup!R$3,FALSE))","v":"-"},{"$f":"IF(ISNA(VLOOKUP(CONCATENATE($A25,$A$4),Data!$A$2:$S$100,Lookup!S$3,FALSE)),\"\",VLOOKUP(CONCATENATE($A25,$A$4),Data!$A$2:$S$100,Lookup!S$3,FALSE))","v":1435.2663763725861},{"$f":"IF(ISNA(VLOOKUP(CONCATENATE($A25,$A$4),Data!$A$2:$S$100,Lookup!T$3,FALSE)),\"\",VLOOKUP(CONCATENATE($A25,$A$4),Data!$A$2:$S$100,Lookup!T$3,FALSE))","v":111.44415681642006}]
[14,{"$f":"IF(ISNA(VLOOKUP(CONCATENATE($A26,$A$4),Data!$A$2:$S$100,Lookup!C$3,FALSE)),\"\",VLOOKUP(CONCATENATE($A26,$A$4),Data!$A$2:$S$100,Lookup!C$3,FALSE))","v":"Crosshouse Hospital"},{"$f":"IF(ISNA(VLOOKUP(CONCATENATE($A26,$A$4),Data!$A$2:$S$100,Lookup!D$3,FALSE)),\"\",VLOOKUP(CONCATENATE($A26,$A$4),Data!$A$2:$S$100,Lookup!D$3,FALSE))","v":"A"},{"$f":"IF(ISNA(VLOOKUP(CONCATENATE($A26,$A$4),Data!$A$2:$S$100,Lookup!E$3,FALSE)),\"\",VLOOKUP(CONCATENATE($A26,$A$4),Data!$A$2:$S$100,Lookup!E$3,FALSE))","v":"A2"},{"$f":"IF(ISNA(VLOOKUP(CONCATENATE($A26,$A$4),Data!$A$2:$S$100,Lookup!F$3,FALSE)),\"\",VLOOKUP(CONCATENATE($A26,$A$4),Data!$A$2:$S$100,Lookup!F$3,FALSE))","v":13},{"$f":"IF(ISNA(VLOOKUP(CONCATENATE($A26,$A$4),Data!$A$2:$S$100,Lookup!G$3,FALSE)),\"\",VLOOKUP(CONCATENATE($A26,$A$4),Data!$A$2:$S$100,Lookup!G$3,FALSE))","v":471.23076923076923},{"$f":"IF(ISNA(VLOOKUP(CONCATENATE($A26,$A$4),Data!$A$2:$S$100,Lookup!H$3,FALSE)),\"\",VLOOKUP(CONCATENATE($A26,$A$4),Data!$A$2:$S$100,Lookup!H$3,FALSE))","v":36.248520710059168},{"$f":"IF(ISNA(VLOOKUP(CONCATENATE($A26,$A$4),Data!$A$2:$S$100,Lookup!I$3,FALSE)),\"\",VLOOKUP(CONCATENATE($A26,$A$4),Data!$A$2:$S$100,Lookup!I$3,FALSE))","v":140.86064464413985},{"$f":"IF(ISNA(VLOOKUP(CONCATENATE($A26,$A$4),Data!$A$2:$S$100,Lookup!J$3,FALSE)),\"\",VLOOKUP(CONCATENATE($A26,$A$4),Data!$A$2:$S$100,Lookup!J$3,FALSE))","v":5402.116},{"$f":"IF(ISNA(VLOOKUP(CONCATENATE($A26,$A$4),Data!$A$2:$S$100,Lookup!K$3,FALSE)),\"\",VLOOKUP(CONCATENATE($A26,$A$4),Data!$A$2:$S$100,Lookup!K$3,FALSE))","v":6930.4380000000001},{"$f":"IF(ISNA(VLOOKUP(CONCATENATE($A26,$A$4),Data!$A$2:$S$100,Lookup!L$3,FALSE)),\"\",VLOOKUP(CONCATENATE($A26,$A$4),Data!$A$2:$S$100,Lookup!L$3,FALSE))","v":71.516999999999996},{"$f":"IF(ISNA(VLOOKUP(CONCATENATE($A26,$A$4),Data!$A$2:$S$100,Lookup!M$3,FALSE)),\"\",VLOOKUP(CONCATENATE($A26,$A$4),Data!$A$2:$S$100,Lookup!M$3,FALSE))","v":567.66700000000003},{"$f":"IF(ISNA(VLOOKUP(CONCATENATE($A26,$A$4),Data!$A$2:$S$100,Lookup!N$3,FALSE)),\"\",VLOOKUP(CONCATENATE($A26,$A$4),Data!$A$2:$S$100,Lookup!N$3,FALSE))","v":1171.2539999999999},{"$f":"IF(ISNA(VLOOKUP(CONCATENATE($A26,$A$4),Data!$A$2:$S$100,Lookup!O$3,FALSE)),\"\",VLOOKUP(CONCATENATE($A26,$A$4),Data!$A$2:$S$100,Lookup!O$3,FALSE))","v":4352.2889999999998},{"$f":"IF(ISNA(VLOOKUP(CONCATENATE($A26,$A$4),Data!$A$2:$S$100,Lookup!P$3,FALSE)),\"\",VLOOKUP(CONCATENATE($A26,$A$4),Data!$A$2:$S$100,Lookup!P$3,FALSE))","v":4320.3069999999998},{"$f":"IF(ISNA(VLOOKUP(CONCATENATE($A26,$A$4),Data!$A$2:$S$100,Lookup!Q$3,FALSE)),\"\",VLOOKUP(CONCATENATE($A26,$A$4),Data!$A$2:$S$100,Lookup!Q$3,FALSE))","v":22815.588},{"$f":"IF(ISNA(VLOOKUP(CONCATENATE($A26,$A$4),Data!$A$2:$S$100,Lookup!R$3,FALSE)),\"\",VLOOKUP(CONCATENATE($A26,$A$4),Data!$A$2:$S$100,Lookup!R$3,FALSE))","v":"-"},{"$f":"IF(ISNA(VLOOKUP(CONCATENATE($A26,$A$4),Data!$A$2:$S$100,Lookup!S$3,FALSE)),\"\",VLOOKUP(CONCATENATE($A26,$A$4),Data!$A$2:$S$100,Lookup!S$3,FALSE))","v":931.09647404505392},{"$f":"IF(ISNA(VLOOKUP(CONCATENATE($A26,$A$4),Data!$A$2:$S$100,Lookup!T$3,FALSE)),\"\",VLOOKUP(CONCATENATE($A26,$A$4),Data!$A$2:$S$100,Lookup!T$3,FALSE))","v":72.296866402558265}]
[15,{"$f":"IF(ISNA(VLOOKUP(CONCATENATE($A27,$A$4),Data!$A$2:$S$100,Lookup!C$3,FALSE)),\"\",VLOOKUP(CONCATENATE($A27,$A$4),Data!$A$2:$S$100,Lookup!C$3,FALSE))","v":"Hairmyres, East Kilbride"},{"$f":"IF(ISNA(VLOOKUP(CONCATENATE($A27,$A$4),Data!$A$2:$S$100,Lookup!D$3,FALSE)),\"\",VLOOKUP(CONCATENATE($A27,$A$4),Data!$A$2:$S$100,Lookup!D$3,FALSE))","v":"L"},{"$f":"IF(ISNA(VLOOKUP(CONCATENATE($A27,$A$4),Data!$A$2:$S$100,Lookup!E$3,FALSE)),\"\",VLOOKUP(CONCATENATE($A27,$A$4),Data!$A$2:$S$100,Lookup!E$3,FALSE))","v":"A2"},{"$f":"IF(ISNA(VLOOKUP(CONCATENATE($A27,$A$4),Data!$A$2:$S$100,Lookup!F$3,FALSE)),\"\",VLOOKUP(CONCATENATE($A27,$A$4),Data!$A$2:$S$100,Lookup!F$3,FALSE))","v":8},{"$f":"IF(ISNA(VLOOKUP(CONCATENATE($A27,$A$4),Data!$A$2:$S$100,Lookup!G$3,FALSE)),\"\",VLOOKUP(CONCATENATE($A27,$A$4),Data!$A$2:$S$100,Lookup!G$3,FALSE))","v":253.17307692307693},{"$f":"IF(ISNA(VLOOKUP(CONCATENATE($A27,$A$4),Data!$A$2:$S$100,Lookup!H$3,FALSE)),\"\",VLOOKUP(CONCATENATE($A27,$A$4),Data!$A$2:$S$100,Lookup!H$3,FALSE))","v":31.646634615384617},{"$f":"IF(ISNA(VLOOKUP(CONCATENATE($A27,$A$4),Data!$A$2:$S$100,Lookup!I$3,FALSE)),\"\",VLOOKUP(CONCATENATE($A27,$A$4),Data!$A$2:$S$100,Lookup!I$3,FALSE))","v":122.97785579712148},{"$f":"IF(ISNA(VLOOKUP(CONCATENATE($A27,$A$4),Data!$A$2:$S$100,Lookup!J$3,FALSE)),\"\",VLOOKUP(CONCATENATE($A27,$A$4),Data!$A$2:$S$100,Lookup!J$3,FALSE))","v":3727.511},{"$f":"IF(ISNA(VLOOKUP(CONCATENATE($A27,$A$4),Data!$A$2:$S$100,Lookup!K$3,FALSE)),\"\",VLOOKUP(CONCATENATE($A27,$A$4),Data!$A$2:$S$100,Lookup!K$3,FALSE))","v":4551.5929999999998},{"$f":"IF(ISNA(VLOOKUP(CONCATENATE($A27,$A$4),Data!$A$2:$S$100,Lookup!L$3,FALSE)),\"\",VLOOKUP(CONCATENATE($A27,$A$4),Data!$A$2:$S$100,Lookup!L$3,FALSE))","v":183.364},{"$f":"IF(ISNA(VLOOKUP(CONCATENATE($A27,$A$4),Data!$A$2:$S$100,Lookup!M$3,FALSE)),\"\",VLOOKUP(CONCATENATE($A27,$A$4),Data!$A$2:$S$100,Lookup!M$3,FALSE))","v":348.19900000000001},{"$f":"IF(ISNA(VLOOKUP(CONCATENATE($A27,$A$4),Data!$A$2:$S$100,Lookup!N$3,FALSE)),\"\",VLOOKUP(CONCATENATE($A27,$A$4),Data!$A$2:$S$100,Lookup!N$3,FALSE))","v":368.93599999999998},{"$f":"IF(ISNA(VLOOKUP(CONCATENATE($A27,$A$4),Data!$A$2:$S$100,Lookup!O$3,FALSE)),\"\",VLOOKUP(CONCATENATE($A27,$A$4),Data!$A$2:$S$100,Lookup!O$3,FALSE))","v":5040.99},{"$f":"IF(ISNA(VLOOKUP(CONCATENATE($A27,$A$4),Data!$A$2:$S$100,Lookup!P$3,FALSE)),\"\",VLOOKUP(CONCATENATE($A27,$A$4),Data!$A$2:$S$100,Lookup!P$3,FALSE))","v":4566.0680000000002},{"$f":"IF(ISNA(VLOOKUP(CONCATENATE($A27,$A$4),Data!$A$2:$S$100,Lookup!Q$3,FALSE)),\"\",VLOOKUP(CONCATENATE($A27,$A$4),Data!$A$2:$S$100,Lookup!Q$3,FALSE))","v":18786.661},{"$f":"IF(ISNA(VLOOKUP(CONCATENATE($A27,$A$4),Data!$A$2:$S$100,Lookup!R$3,FALSE)),\"\",VLOOKUP(CONCATENATE($A27,$A$4),Data!$A$2:$S$100,Lookup!R$3,FALSE))","v":"-"},{"$f":"IF(ISNA(VLOOKUP(CONCATENATE($A27,$A$4),Data!$A$2:$S$100,Lookup!S$3,FALSE)),\"\",VLOOKUP(CONCATENATE($A27,$A$4),Data!$A$2:$S$100,Lookup!S$3,FALSE))","v":1427.0156475503229},{"$f":"IF(ISNA(VLOOKUP(CONCATENATE($A27,$A$4),Data!$A$2:$S$100,Lookup!T$3,FALSE)),\"\",VLOOKUP(CONCATENATE($A27,$A$4),Data!$A$2:$S$100,Lookup!T$3,FALSE))","v":110.80351231177978}]
[16,{"$f":"IF(ISNA(VLOOKUP(CONCATENATE($A28,$A$4),Data!$A$2:$S$100,Lookup!C$3,FALSE)),\"\",VLOOKUP(CONCATENATE($A28,$A$4),Data!$A$2:$S$100,Lookup!C$3,FALSE))","v":"Raigmore, Inverness"},{"$f":"IF(ISNA(VLOOKUP(CONCATENATE($A28,$A$4),Data!$A$2:$S$100,Lookup!D$3,FALSE)),\"\",VLOOKUP(CONCATENATE($A28,$A$4),Data!$A$2:$S$100,Lookup!D$3,FALSE))","v":"H"},{"$f":"IF(ISNA(VLOOKUP(CONCATENATE($A28,$A$4),Data!$A$2:$S$100,Lookup!E$3,FALSE)),\"\",VLOOKUP(CONCATENATE($A28,$A$4),Data!$A$2:$S$100,Lookup!E$3,FALSE))","v":"A2"},{"$f":"IF(ISNA(VLOOKUP(CONCATENATE($A28,$A$4),Data!$A$2:$S$100,Lookup!F$3,FALSE)),\"\",VLOOKUP(CONCATENATE($A28,$A$4),Data!$A$2:$S$100,Lookup!F$3,FALSE))","v":13},{"$f":"IF(ISNA(VLOOKUP(CONCATENATE($A28,$A$4),Data!$A$2:$S$100,Lookup!G$3,FALSE)),\"\",VLOOKUP(CONCATENATE($A28,$A$4),Data!$A$2:$S$100,Lookup!G$3,FALSE))","v":315.44499999999999},{"$f":"IF(ISNA(VLOOKUP(CONCATENATE($A28,$A$4),Data!$A$2:$S$100,Lookup!H$3,FALSE)),\"\",VLOOKUP(CONCATENATE($A28,$A$4),Data!$A$2:$S$100,Lookup!H$3,FALSE))","v":24.265000000000001},{"$f":"IF(ISNA(VLOOKUP(CONCATENATE($A28,$A$4),Data!$A$2:$S$100,Lookup!I$3,FALSE)),\"\",VLOOKUP(CONCATENATE($A28,$A$4),Data!$A$2:$S$100,Lookup!I$3,FALSE))","v":94.293049077215002},{"$f":"IF(ISNA(VLOOKUP(CONCATENATE($A28,$A$4),Data!$A$2:$S$100,Lookup!J$3,FALSE)),\"\",VLOOKUP(CONCATENATE($A28,$A$4),Data!$A$2:$S$100,Lookup!J$3,FALSE))","v":4365.7950599999995},{"$f":"IF(ISNA(VLOOKUP(CONCATENATE($A28,$A$4),Data!$A$2:$S$100,Lookup!K$3,FALSE)),\"\",VLOOKUP(CONCATENATE($A28,$A$4),Data!$A$2:$S$100,Lookup!K$3,FALSE))","v":5858.10689},{"$f":"IF(ISNA(VLOOKUP(CONCATENATE($A28,$A$4),Data!$A$2:$S$100,Lookup!L$3,FALSE)),\"\",VLOOKUP(CONCATENATE($A28,$A$4),Data!$A$2:$S$100,Lookup!L$3,FALSE))","v":322.69355999999999},{"$f":"IF(ISNA(VLOOKUP(CONCATENATE($A28,$A$4),Data!$A$2:$S$100,Lookup!M$3,FALSE)),\"\",VLOOKUP(CONCATENATE($A28,$A$4),Data!$A$2:$S$100,Lookup!M$3,FALSE))","v":694.09401000000003},{"$f":"IF(ISNA(VLOOKUP(CONCATENATE($A28,$A$4),Data!$A$2:$S$100,Lookup!N$3,FALSE)),\"\",VLOOKUP(CONCATENATE($A28,$A$4),Data!$A$2:$S$100,Lookup!N$3,FALSE))","v":2.6764200000000002},{"$f":"IF(ISNA(VLOOKUP(CONCATENATE($A28,$A$4),Data!$A$2:$S$100,Lookup!O$3,FALSE)),\"\",VLOOKUP(CONCATENATE($A28,$A$4),Data!$A$2:$S$100,Lookup!O$3,FALSE))","v":6926.3276699999997},{"$f":"IF(ISNA(VLOOKUP(CONCATENATE($A28,$A$4),Data!$A$2:$S$100,Lookup!P$3,FALSE)),\"\",VLOOKUP(CONCATENATE($A28,$A$4),Data!$A$2:$S$100,Lookup!P$3,FALSE))","v":5060.0819000000001},{"$f":"IF(ISNA(VLOOKUP(CONCATENATE($A28,$A$4),Data!$A$2:$S$100,Lookup!Q$3,FALSE)),\"\",VLOOKUP(CONCATENATE($A28,$A$4),Data!$A$2:$S$100,Lookup!Q$3,FALSE))","v":23229.775510000003},{"$f":"IF(ISNA(VLOOKUP(CONCATENATE($A28,$A$4),Data!$A$2:$S$100,Lookup!R$3,FALSE)),\"\",VLOOKUP(CONCATENATE($A28,$A$4),Data!$A$2:$S$100,Lookup!R$3,FALSE))","v":80.553179999999998},{"$f":"IF(ISNA(VLOOKUP(CONCATENATE($A28,$A$4),Data!$A$2:$S$100,Lookup!S$3,FALSE)),\"\",VLOOKUP(CONCATENATE($A28,$A$4),Data!$A$2:$S$100,Lookup!S$3,FALSE))","v":1416.1785798328858},{"$f":"IF(ISNA(VLOOKUP(CONCATENATE($A28,$A$4),Data!$A$2:$S$100,Lookup!T$3,FALSE)),\"\",VLOOKUP(CONCATENATE($A28,$A$4),Data!$A$2:$S$100,Lookup!T$3,FALSE))","v":109.96204629960677}]
[17,{"$f":"IF(ISNA(VLOOKUP(CONCATENATE($A29,$A$4),Data!$A$2:$S$100,Lookup!C$3,FALSE)),\"\",VLOOKUP(CONCATENATE($A29,$A$4),Data!$A$2:$S$100,Lookup!C$3,FALSE))","v":"St. John's at Howden"},{"$f":"IF(ISNA(VLOOKUP(CONCATENATE($A29,$A$4),Data!$A$2:$S$100,Lookup!D$3,FALSE)),\"\",VLOOKUP(CONCATENATE($A29,$A$4),Data!$A$2:$S$100,Lookup!D$3,FALSE))","v":"S"},{"$f":"IF(ISNA(VLOOKUP(CONCATENATE($A29,$A$4),Data!$A$2:$S$100,Lookup!E$3,FALSE)),\"\",VLOOKUP(CONCATENATE($A29,$A$4),Data!$A$2:$S$100,Lookup!E$3,FALSE))","v":"A2"},{"$f":"IF(ISNA(VLOOKUP(CONCATENATE($A29,$A$4),Data!$A$2:$S$100,Lookup!F$3,FALSE)),\"\",VLOOKUP(CONCATENATE($A29,$A$4),Data!$A$2:$S$100,Lookup!F$3,FALSE))","v":14},{"$f":"IF(ISNA(VLOOKUP(CONCATENATE($A29,$A$4),Data!$A$2:$S$100,Lookup!G$3,FALSE)),\"\",VLOOKUP(CONCATENATE($A29,$A$4),Data!$A$2:$S$100,Lookup!G$3,FALSE))","v":279.96153846153845},{"$f":"IF(ISNA(VLOOKUP(CONCATENATE($A29,$A$4),Data!$A$2:$S$100,Lookup!H$3,FALSE)),\"\",VLOOKUP(CONCATENATE($A29,$A$4),Data!$A$2:$S$100,Lookup!H$3,FALSE))","v":19.997252747252748},{"$f":"IF(ISNA(VLOOKUP(CONCATENATE($A29,$A$4),Data!$A$2:$S$100,Lookup!I$3,FALSE)),\"\",VLOOKUP(CONCATENATE($A29,$A$4),Data!$A$2:$S$100,Lookup!I$3,FALSE))","v":77.708713567120384},{"$f":"IF(ISNA(VLOOKUP(CONCATENATE($A29,$A$4),Data!$A$2:$S$100,Lookup!J$3,FALSE)),\"\",VLOOKUP(CONCATENATE($A29,$A$4),Data!$A$2:$S$100,Lookup!J$3,FALSE))","v":6081.8729999999996},{"$f":"IF(ISNA(VLOOKUP(CONCATENATE($A29,$A$4),Data!$A$2:$S$100,Lookup!K$3,FALSE)),\"\",VLOOKUP(CONCATENATE($A29,$A$4),Data!$A$2:$S$100,Lookup!K$3,FALSE))","v":6356.0910000000003},{"$f":"IF(ISNA(VLOOKUP(CONCATENATE($A29,$A$4),Data!$A$2:$S$100,Lookup!L$3,FALSE)),\"\",VLOOKUP(CONCATENATE($A29,$A$4),Data!$A$2:$S$100,Lookup!L$3,FALSE))","v":1665.9090000000001},{"$f":"IF(ISNA(VLOOKUP(CONCATENATE($A29,$A$4),Data!$A$2:$S$100,Lookup!M$3,FALSE)),\"\",VLOOKUP(CONCATENATE($A29,$A$4),Data!$A$2:$S$100,Lookup!M$3,FALSE))","v":553.81700000000001},{"$f":"IF(ISNA(VLOOKUP(CONCATENATE($A29,$A$4),Data!$A$2:$S$100,Lookup!N$3,FALSE)),\"\",VLOOKUP(CONCATENATE($A29,$A$4),Data!$A$2:$S$100,Lookup!N$3,FALSE))","v":1533.07},{"$f":"IF(ISNA(VLOOKUP(CONCATENATE($A29,$A$4),Data!$A$2:$S$100,Lookup!O$3,FALSE)),\"\",VLOOKUP(CONCATENATE($A29,$A$4),Data!$A$2:$S$100,Lookup!O$3,FALSE))","v":3523.076},{"$f":"IF(ISNA(VLOOKUP(CONCATENATE($A29,$A$4),Data!$A$2:$S$100,Lookup!P$3,FALSE)),\"\",VLOOKUP(CONCATENATE($A29,$A$4),Data!$A$2:$S$100,Lookup!P$3,FALSE))","v":639.80200000000002},{"$f":"IF(ISNA(VLOOKUP(CONCATENATE($A29,$A$4),Data!$A$2:$S$100,Lookup!Q$3,FALSE)),\"\",VLOOKUP(CONCATENATE($A29,$A$4),Data!$A$2:$S$100,Lookup!Q$3,FALSE))","v":20353.637999999999},{"$f":"IF(ISNA(VLOOKUP(CONCATENATE($A29,$A$4),Data!$A$2:$S$100,Lookup!R$3,FALSE)),\"\",VLOOKUP(CONCATENATE($A29,$A$4),Data!$A$2:$S$100,Lookup!R$3,FALSE))","v":"-"},{"$f":"IF(ISNA(VLOOKUP(CONCATENATE($A29,$A$4),Data!$A$2:$S$100,Lookup!S$3,FALSE)),\"\",VLOOKUP(CONCATENATE($A29,$A$4),Data!$A$2:$S$100,Lookup!S$3,FALSE))","v":1398.1067454320648},{"$f":"IF(ISNA(VLOOKUP(CONCATENATE($A29,$A$4),Data!$A$2:$S$100,Lookup!T$3,FALSE)),\"\",VLOOKUP(CONCATENATE($A29,$A$4),Data!$A$2:$S$100,Lookup!T$3,FALSE))","v":108.55882221515805}]
[18,{"$f":"IF(ISNA(VLOOKUP(CONCATENATE($A30,$A$4),Data!$A$2:$S$100,Lookup!C$3,FALSE)),\"\",VLOOKUP(CONCATENATE($A30,$A$4),Data!$A$2:$S$100,Lookup!C$3,FALSE))","v":"Monklands Hospital"},{"$f":"IF(ISNA(VLOOKUP(CONCATENATE($A30,$A$4),Data!$A$2:$S$100,Lookup!D$3,FALSE)),\"\",VLOOKUP(CONCATENATE($A30,$A$4),Data!$A$2:$S$100,Lookup!D$3,FALSE))","v":"L"},{"$f":"IF(ISNA(VLOOKUP(CONCATENATE($A30,$A$4),Data!$A$2:$S$100,Lookup!E$3,FALSE)),\"\",VLOOKUP(CONCATENATE($A30,$A$4),Data!$A$2:$S$100,Lookup!E$3,FALSE))","v":"A2"},{"$f":"IF(ISNA(VLOOKUP(CONCATENATE($A30,$A$4),Data!$A$2:$S$100,Lookup!F$3,FALSE)),\"\",VLOOKUP(CONCATENATE($A30,$A$4),Data!$A$2:$S$100,Lookup!F$3,FALSE))","v":9},{"$f":"IF(ISNA(VLOOKUP(CONCATENATE($A30,$A$4),Data!$A$2:$S$100,Lookup!G$3,FALSE)),\"\",VLOOKUP(CONCATENATE($A30,$A$4),Data!$A$2:$S$100,Lookup!G$3,FALSE))","v":214.38461538461539},{"$f":"IF(ISNA(VLOOKUP(CONCATENATE($A30,$A$4),Data!$A$2:$S$100,Lookup!H$3,FALSE)),\"\",VLOOKUP(CONCATENATE($A30,$A$4),Data!$A$2:$S$100,Lookup!H$3,FALSE))","v":23.820512820512821},{"$f":"IF(ISNA(VLOOKUP(CONCATENATE($A30,$A$4),Data!$A$2:$S$100,Lookup!I$3,FALSE)),\"\",VLOOKUP(CONCATENATE($A30,$A$4),Data!$A$2:$S$100,Lookup!I$3,FALSE))","v":92.565785469979176},{"$f":"IF(ISNA(VLOOKUP(CONCATENATE($A30,$A$4),Data!$A$2:$S$100,Lookup!J$3,FALSE)),\"\",VLOOKUP(CONCATENATE($A30,$A$4),Data!$A$2:$S$100,Lookup!J$3,FALSE))","v":4266.3320000000003},{"$f":"IF(ISNA(VLOOKUP(CONCATENATE($A30,$A$4),Data!$A$2:$S$100,Lookup!K$3,FALSE)),\"\",VLOOKUP(CONCATENATE($A30,$A$4),Data!$A$2:$S$100,Lookup!K$3,FALSE))","v":3601.5729999999999},{"$f":"IF(ISNA(VLOOKUP(CONCATENATE($A30,$A$4),Data!$A$2:$S$100,Lookup!L$3,FALSE)),\"\",VLOOKUP(CONCATENATE($A30,$A$4),Data!$A$2:$S$100,Lookup!L$3,FALSE))","v":115.681},{"$f":"IF(ISNA(VLOOKUP(CONCATENATE($A30,$A$4),Data!$A$2:$S$100,Lookup!M$3,FALSE)),\"\",VLOOKUP(CONCATENATE($A30,$A$4),Data!$A$2:$S$100,Lookup!M$3,FALSE))","v":285.983},{"$f":"IF(ISNA(VLOOKUP(CONCATENATE($A30,$A$4),Data!$A$2:$S$100,Lookup!N$3,FALSE)),\"\",VLOOKUP(CONCATENATE($A30,$A$4),Data!$A$2:$S$100,Lookup!N$3,FALSE))","v":183.43700000000001},{"$f":"IF(ISNA(VLOOKUP(CONCATENATE($A30,$A$4),Data!$A$2:$S$100,Lookup!O$3,FALSE)),\"\",VLOOKUP(CONCATENATE($A30,$A$4),Data!$A$2:$S$100,Lookup!O$3,FALSE))","v":2794.672},{"$f":"IF(ISNA(VLOOKUP(CONCATENATE($A30,$A$4),Data!$A$2:$S$100,Lookup!P$3,FALSE)),\"\",VLOOKUP(CONCATENATE($A30,$A$4),Data!$A$2:$S$100,Lookup!P$3,FALSE))","v":4153.4970000000003},{"$f":"IF(ISNA(VLOOKUP(CONCATENATE($A30,$A$4),Data!$A$2:$S$100,Lookup!Q$3,FALSE)),\"\",VLOOKUP(CONCATENATE($A30,$A$4),Data!$A$2:$S$100,Lookup!Q$3,FALSE))","v":15401.174999999999},{"$f":"IF(ISNA(VLOOKUP(CONCATENATE($A30,$A$4),Data!$A$2:$S$100,Lookup!R$3,FALSE)),\"\",VLOOKUP(CONCATENATE($A30,$A$4),Data!$A$2:$S$100,Lookup!R$3,FALSE))","v":"-"},{"$f":"IF(ISNA(VLOOKUP(CONCATENATE($A30,$A$4),Data!$A$2:$S$100,Lookup!S$3,FALSE)),\"\",VLOOKUP(CONCATENATE($A30,$A$4),Data!$A$2:$S$100,Lookup!S$3,FALSE))","v":1381.5191065662002},{"$f":"IF(ISNA(VLOOKUP(CONCATENATE($A30,$A$4),Data!$A$2:$S$100,Lookup!T$3,FALSE)),\"\",VLOOKUP(CONCATENATE($A30,$A$4),Data!$A$2:$S$100,Lookup!T$3,FALSE))","v":107.27084149087354}]
[19,{"$f":"IF(ISNA(VLOOKUP(CONCATENATE($A31,$A$4),Data!$A$2:$S$100,Lookup!C$3,FALSE)),\"\",VLOOKUP(CONCATENATE($A31,$A$4),Data!$A$2:$S$100,Lookup!C$3,FALSE))","v":"The Ayr Hospital"},{"$f":"IF(ISNA(VLOOKUP(CONCATENATE($A31,$A$4),Data!$A$2:$S$100,Lookup!D$3,FALSE)),\"\",VLOOKUP(CONCATENATE($A31,$A$4),Data!$A$2:$S$100,Lookup!D$3,FALSE))","v":"A"},{"$f":"IF(ISNA(VLOOKUP(CONCATENATE($A31,$A$4),Data!$A$2:$S$100,Lookup!E$3,FALSE)),\"\",VLOOKUP(CONCATENATE($A31,$A$4),Data!$A$2:$S$100,Lookup!E$3,FALSE))","v":"A2"},{"$f":"IF(ISNA(VLOOKUP(CONCATENATE($A31,$A$4),Data!$A$2:$S$100,Lookup!F$3,FALSE)),\"\",VLOOKUP(CONCATENATE($A31,$A$4),Data!$A$2:$S$100,Lookup!F$3,FALSE))","v":11},{"$f":"IF(ISNA(VLOOKUP(CONCATENATE($A31,$A$4),Data!$A$2:$S$100,Lookup!G$3,FALSE)),\"\",VLOOKUP(CONCATENATE($A31,$A$4),Data!$A$2:$S$100,Lookup!G$3,FALSE))","v":306.71153846153845},{"$f":"IF(ISNA(VLOOKUP(CONCATENATE($A31,$A$4),Data!$A$2:$S$100,Lookup!H$3,FALSE)),\"\",VLOOKUP(CONCATENATE($A31,$A$4),Data!$A$2:$S$100,Lookup!H$3,FALSE))","v":27.882867132867133},{"$f":"IF(ISNA(VLOOKUP(CONCATENATE($A31,$A$4),Data!$A$2:$S$100,Lookup!I$3,FALSE)),\"\",VLOOKUP(CONCATENATE($A31,$A$4),Data!$A$2:$S$100,Lookup!I$3,FALSE))","v":108.35197028530419},{"$f":"IF(ISNA(VLOOKUP(CONCATENATE($A31,$A$4),Data!$A$2:$S$100,Lookup!J$3,FALSE)),\"\",VLOOKUP(CONCATENATE($A31,$A$4),Data!$A$2:$S$100,Lookup!J$3,FALSE))","v":3060.797},{"$f":"IF(ISNA(VLOOKUP(CONCATENATE($A31,$A$4),Data!$A$2:$S$100,Lookup!K$3,FALSE)),\"\",VLOOKUP(CONCATENATE($A31,$A$4),Data!$A$2:$S$100,Lookup!K$3,FALSE))","v":4530.3149999999996},{"$f":"IF(ISNA(VLOOKUP(CONCATENATE($A31,$A$4),Data!$A$2:$S$100,Lookup!L$3,FALSE)),\"\",VLOOKUP(CONCATENATE($A31,$A$4),Data!$A$2:$S$100,Lookup!L$3,FALSE))","v":872.26400000000001},{"$f":"IF(ISNA(VLOOKUP(CONCATENATE($A31,$A$4),Data!$A$2:$S$100,Lookup!M$3,FALSE)),\"\",VLOOKUP(CONCATENATE($A31,$A$4),Data!$A$2:$S$100,Lookup!M$3,FALSE))","v":977.476},{"$f":"IF(ISNA(VLOOKUP(CONCATENATE($A31,$A$4),Data!$A$2:$S$100,Lookup!N$3,FALSE)),\"\",VLOOKUP(CONCATENATE($A31,$A$4),Data!$A$2:$S$100,Lookup!N$3,FALSE))","v":780.82299999999998},{"$f":"IF(ISNA(VLOOKUP(CONCATENATE($A31,$A$4),Data!$A$2:$S$100,Lookup!O$3,FALSE)),\"\",VLOOKUP(CONCATENATE($A31,$A$4),Data!$A$2:$S$100,Lookup!O$3,FALSE))","v":3256.7429999999999},{"$f":"IF(ISNA(VLOOKUP(CONCATENATE($A31,$A$4),Data!$A$2:$S$100,Lookup!P$3,FALSE)),\"\",VLOOKUP(CONCATENATE($A31,$A$4),Data!$A$2:$S$100,Lookup!P$3,FALSE))","v":2813.681},{"$f":"IF(ISNA(VLOOKUP(CONCATENATE($A31,$A$4),Data!$A$2:$S$100,Lookup!Q$3,FALSE)),\"\",VLOOKUP(CONCATENATE($A31,$A$4),Data!$A$2:$S$100,Lookup!Q$3,FALSE))","v":16292.099},{"$f":"IF(ISNA(VLOOKUP(CONCATENATE($A31,$A$4),Data!$A$2:$S$100,Lookup!R$3,FALSE)),\"\",VLOOKUP(CONCATENATE($A31,$A$4),Data!$A$2:$S$100,Lookup!R$3,FALSE))","v":"-"},{"$f":"IF(ISNA(VLOOKUP(CONCATENATE($A31,$A$4),Data!$A$2:$S$100,Lookup!S$3,FALSE)),\"\",VLOOKUP(CONCATENATE($A31,$A$4),Data!$A$2:$S$100,Lookup!S$3,FALSE))","v":1021.512257821807},{"$f":"IF(ISNA(VLOOKUP(CONCATENATE($A31,$A$4),Data!$A$2:$S$100,Lookup!T$3,FALSE)),\"\",VLOOKUP(CONCATENATE($A31,$A$4),Data!$A$2:$S$100,Lookup!T$3,FALSE))","v":79.317382560236481}]
[20,{"$f":"IF(ISNA(VLOOKUP(CONCATENATE($A32,$A$4),Data!$A$2:$S$100,Lookup!C$3,FALSE)),\"\",VLOOKUP(CONCATENATE($A32,$A$4),Data!$A$2:$S$100,Lookup!C$3,FALSE))","v":"New Dumfries and Galloway Royal Infirmary"},{"$f":"IF(ISNA(VLOOKUP(CONCATENATE($A32,$A$4),Data!$A$2:$S$100,Lookup!D$3,FALSE)),\"\",VLOOKUP(CONCATENATE($A32,$A$4),Data!$A$2:$S$100,Lookup!D$3,FALSE))","v":"Y"},{"$f":"IF(ISNA(VLOOKUP(CONCATENATE($A32,$A$4),Data!$A$2:$S$100,Lookup!E$3,FALSE)),\"\",VLOOKUP(CONCATENATE($A32,$A$4),Data!$A$2:$S$100,Lookup!E$3,FALSE))","v":"A2"},{"$f":"IF(ISNA(VLOOKUP(CONCATENATE($A32,$A$4),Data!$A$2:$S$100,Lookup!F$3,FALSE)),\"\",VLOOKUP(CONCATENATE($A32,$A$4),Data!$A$2:$S$100,Lookup!F$3,FALSE))","v":9},{"$f":"IF(ISNA(VLOOKUP(CONCATENATE($A32,$A$4),Data!$A$2:$S$100,Lookup!G$3,FALSE)),\"\",VLOOKUP(CONCATENATE($A32,$A$4),Data!$A$2:$S$100,Lookup!G$3,FALSE))","v":223.65384615384616},{"$f":"IF(ISNA(VLOOKUP(CONCATENATE($A32,$A$4),Data!$A$2:$S$100,Lookup!H$3,FALSE)),\"\",VLOOKUP(CONCATENATE($A32,$A$4),Data!$A$2:$S$100,Lookup!H$3,FALSE))","v":24.850427350427353},{"$f":"IF(ISNA(VLOOKUP(CONCATENATE($A32,$A$4),Data!$A$2:$S$100,Lookup!I$3,FALSE)),\"\",VLOOKUP(CONCATENATE($A32,$A$4),Data!$A$2:$S$100,Lookup!I$3,FALSE))","v":96.568001885168457},{"$f":"IF(ISNA(VLOOKUP(CONCATENATE($A32,$A$4),Data!$A$2:$S$100,Lookup!J$3,FALSE)),\"\",VLOOKUP(CONCATENATE($A32,$A$4),Data!$A$2:$S$100,Lookup!J$3,FALSE))","v":2783.797},{"$f":"IF(ISNA(VLOOKUP(CONCATENATE($A32,$A$4),Data!$A$2:$S$100,Lookup!K$3,FALSE)),\"\",VLOOKUP(CONCATENATE($A32,$A$4),Data!$A$2:$S$100,Lookup!K$3,FALSE))","v":4521.777},{"$f":"IF(ISNA(VLOOKUP(CONCATENATE($A32,$A$4),Data!$A$2:$S$100,Lookup!L$3,FALSE)),\"\",VLOOKUP(CONCATENATE($A32,$A$4),Data!$A$2:$S$100,Lookup!L$3,FALSE))","v":272.96600000000001},{"$f":"IF(ISNA(VLOOKUP(CONCATENATE($A32,$A$4),Data!$A$2:$S$100,Lookup!M$3,FALSE)),\"\",VLOOKUP(CONCATENATE($A32,$A$4),Data!$A$2:$S$100,Lookup!M$3,FALSE))","v":285.74400000000003},{"$f":"IF(ISNA(VLOOKUP(CONCATENATE($A32,$A$4),Data!$A$2:$S$100,Lookup!N$3,FALSE)),\"\",VLOOKUP(CONCATENATE($A32,$A$4),Data!$A$2:$S$100,Lookup!N$3,FALSE))","v":15},{"$f":"IF(ISNA(VLOOKUP(CONCATENATE($A32,$A$4),Data!$A$2:$S$100,Lookup!O$3,FALSE)),\"\",VLOOKUP(CONCATENATE($A32,$A$4),Data!$A$2:$S$100,Lookup!O$3,FALSE))","v":2910.0610000000001},{"$f":"IF(ISNA(VLOOKUP(CONCATENATE($A32,$A$4),Data!$A$2:$S$100,Lookup!P$3,FALSE)),\"\",VLOOKUP(CONCATENATE($A32,$A$4),Data!$A$2:$S$100,Lookup!P$3,FALSE))","v":6879.6329999999998},{"$f":"IF(ISNA(VLOOKUP(CONCATENATE($A32,$A$4),Data!$A$2:$S$100,Lookup!Q$3,FALSE)),\"\",VLOOKUP(CONCATENATE($A32,$A$4),Data!$A$2:$S$100,Lookup!Q$3,FALSE))","v":17668.977999999999},{"$f":"IF(ISNA(VLOOKUP(CONCATENATE($A32,$A$4),Data!$A$2:$S$100,Lookup!R$3,FALSE)),\"\",VLOOKUP(CONCATENATE($A32,$A$4),Data!$A$2:$S$100,Lookup!R$3,FALSE))","v":"-"},{"$f":"IF(ISNA(VLOOKUP(CONCATENATE($A32,$A$4),Data!$A$2:$S$100,Lookup!S$3,FALSE)),\"\",VLOOKUP(CONCATENATE($A32,$A$4),Data!$A$2:$S$100,Lookup!S$3,FALSE))","v":1519.25864144454},{"$f":"IF(ISNA(VLOOKUP(CONCATENATE($A32,$A$4),Data!$A$2:$S$100,Lookup!T$3,FALSE)),\"\",VLOOKUP(CONCATENATE($A32,$A$4),Data!$A$2:$S$100,Lookup!T$3,FALSE))","v":117.96590588971907}]
[21,{"$f":"IF(ISNA(VLOOKUP(CONCATENATE($A33,$A$4),Data!$A$2:$S$100,Lookup!C$3,FALSE)),\"\",VLOOKUP(CONCATENATE($A33,$A$4),Data!$A$2:$S$100,Lookup!C$3,FALSE))","v":"Inverclyde Royal Hospital"},{"$f":"IF(ISNA(VLOOKUP(CONCATENATE($A33,$A$4),Data!$A$2:$S$100,Lookup!D$3,FALSE)),\"\",VLOOKUP(CONCATENATE($A33,$A$4),Data!$A$2:$S$100,Lookup!D$3,FALSE))","v":"G"},{"$f":"IF(ISNA(VLOOKUP(CONCATENATE($A33,$A$4),Data!$A$2:$S$100,Lookup!E$3,FALSE)),\"\",VLOOKUP(CONCATENATE($A33,$A$4),Data!$A$2:$S$100,Lookup!E$3,FALSE))","v":"A2"},{"$f":"IF(ISNA(VLOOKUP(CONCATENATE($A33,$A$4),Data!$A$2:$S$100,Lookup!F$3,FALSE)),\"\",VLOOKUP(CONCATENATE($A33,$A$4),Data!$A$2:$S$100,Lookup!F$3,FALSE))","v":7},{"$f":"IF(ISNA(VLOOKUP(CONCATENATE($A33,$A$4),Data!$A$2:$S$100,Lookup!G$3,FALSE)),\"\",VLOOKUP(CONCATENATE($A33,$A$4),Data!$A$2:$S$100,Lookup!G$3,FALSE))","v":122.32692307692308},{"$f":"IF(ISNA(VLOOKUP(CONCATENATE($A33,$A$4),Data!$A$2:$S$100,Lookup!H$3,FALSE)),\"\",VLOOKUP(CONCATENATE($A33,$A$4),Data!$A$2:$S$100,Lookup!H$3,FALSE))","v":17.475274725274726},{"$f":"IF(ISNA(VLOOKUP(CONCATENATE($A33,$A$4),Data!$A$2:$S$100,Lookup!I$3,FALSE)),\"\",VLOOKUP(CONCATENATE($A33,$A$4),Data!$A$2:$S$100,Lookup!I$3,FALSE))","v":67.908383981378321},{"$f":"IF(ISNA(VLOOKUP(CONCATENATE($A33,$A$4),Data!$A$2:$S$100,Lookup!J$3,FALSE)),\"\",VLOOKUP(CONCATENATE($A33,$A$4),Data!$A$2:$S$100,Lookup!J$3,FALSE))","v":2060.5230000000001},{"$f":"IF(ISNA(VLOOKUP(CONCATENATE($A33,$A$4),Data!$A$2:$S$100,Lookup!K$3,FALSE)),\"\",VLOOKUP(CONCATENATE($A33,$A$4),Data!$A$2:$S$100,Lookup!K$3,FALSE))","v":2580.6790000000001},{"$f":"IF(ISNA(VLOOKUP(CONCATENATE($A33,$A$4),Data!$A$2:$S$100,Lookup!L$3,FALSE)),\"\",VLOOKUP(CONCATENATE($A33,$A$4),Data!$A$2:$S$100,Lookup!L$3,FALSE))","v":26},{"$f":"IF(ISNA(VLOOKUP(CONCATENATE($A33,$A$4),Data!$A$2:$S$100,Lookup!M$3,FALSE)),\"\",VLOOKUP(CONCATENATE($A33,$A$4),Data!$A$2:$S$100,Lookup!M$3,FALSE))","v":223.011},{"$f":"IF(ISNA(VLOOKUP(CONCATENATE($A33,$A$4),Data!$A$2:$S$100,Lookup!N$3,FALSE)),\"\",VLOOKUP(CONCATENATE($A33,$A$4),Data!$A$2:$S$100,Lookup!N$3,FALSE))","v":55.835000000000001},{"$f":"IF(ISNA(VLOOKUP(CONCATENATE($A33,$A$4),Data!$A$2:$S$100,Lookup!O$3,FALSE)),\"\",VLOOKUP(CONCATENATE($A33,$A$4),Data!$A$2:$S$100,Lookup!O$3,FALSE))","v":1846.979},{"$f":"IF(ISNA(VLOOKUP(CONCATENATE($A33,$A$4),Data!$A$2:$S$100,Lookup!P$3,FALSE)),\"\",VLOOKUP(CONCATENATE($A33,$A$4),Data!$A$2:$S$100,Lookup!P$3,FALSE))","v":2268.46},{"$f":"IF(ISNA(VLOOKUP(CONCATENATE($A33,$A$4),Data!$A$2:$S$100,Lookup!Q$3,FALSE)),\"\",VLOOKUP(CONCATENATE($A33,$A$4),Data!$A$2:$S$100,Lookup!Q$3,FALSE))","v":9061.4869999999992},{"$f":"IF(ISNA(VLOOKUP(CONCATENATE($A33,$A$4),Data!$A$2:$S$100,Lookup!R$3,FALSE)),\"\",VLOOKUP(CONCATENATE($A33,$A$4),Data!$A$2:$S$100,Lookup!R$3,FALSE))","v":"-"},{"$f":"IF(ISNA(VLOOKUP(CONCATENATE($A33,$A$4),Data!$A$2:$S$100,Lookup!S$3,FALSE)),\"\",VLOOKUP(CONCATENATE($A33,$A$4),Data!$A$2:$S$100,Lookup!S$3,FALSE))","v":1424.5381229366451},{"$f":"IF(ISNA(VLOOKUP(CONCATENATE($A33,$A$4),Data!$A$2:$S$100,Lookup!T$3,FALSE)),\"\",VLOOKUP(CONCATENATE($A33,$A$4),Data!$A$2:$S$100,Lookup!T$3,FALSE))","v":110.61113990892235}]
[22,{"$f":"IF(ISNA(VLOOKUP(CONCATENATE($A34,$A$4),Data!$A$2:$S$100,Lookup!C$3,FALSE)),\"\",VLOOKUP(CONCATENATE($A34,$A$4),Data!$A$2:$S$100,Lookup!C$3,FALSE))","v":"Borders General"},{"$f":"IF(ISNA(VLOOKUP(CONCATENATE($A34,$A$4),Data!$A$2:$S$100,Lookup!D$3,FALSE)),\"\",VLOOKUP(CONCATENATE($A34,$A$4),Data!$A$2:$S$100,Lookup!D$3,FALSE))","v":"B"},{"$f":"IF(ISNA(VLOOKUP(CONCATENATE($A34,$A$4),Data!$A$2:$S$100,Lookup!E$3,FALSE)),\"\",VLOOKUP(CONCATENATE($A34,$A$4),Data!$A$2:$S$100,Lookup!E$3,FALSE))","v":"A2"},{"$f":"IF(ISNA(VLOOKUP(CONCATENATE($A34,$A$4),Data!$A$2:$S$100,Lookup!F$3,FALSE)),\"\",VLOOKUP(CONCATENATE($A34,$A$4),Data!$A$2:$S$100,Lookup!F$3,FALSE))","v":6},{"$f":"IF(ISNA(VLOOKUP(CONCATENATE($A34,$A$4),Data!$A$2:$S$100,Lookup!G$3,FALSE)),\"\",VLOOKUP(CONCATENATE($A34,$A$4),Data!$A$2:$S$100,Lookup!G$3,FALSE))","v":151.11538461538461},{"$f":"IF(ISNA(VLOOKUP(CONCATENATE($A34,$A$4),Data!$A$2:$S$100,Lookup!H$3,FALSE)),\"\",VLOOKUP(CONCATENATE($A34,$A$4),Data!$A$2:$S$100,Lookup!H$3,FALSE))","v":25.185897435897434},{"$f":"IF(ISNA(VLOOKUP(CONCATENATE($A34,$A$4),Data!$A$2:$S$100,Lookup!I$3,FALSE)),\"\",VLOOKUP(CONCATENATE($A34,$A$4),Data!$A$2:$S$100,Lookup!I$3,FALSE))","v":97.871628393850415},{"$f":"IF(ISNA(VLOOKUP(CONCATENATE($A34,$A$4),Data!$A$2:$S$100,Lookup!J$3,FALSE)),\"\",VLOOKUP(CONCATENATE($A34,$A$4),Data!$A$2:$S$100,Lookup!J$3,FALSE))","v":3602.6370000000002},{"$f":"IF(ISNA(VLOOKUP(CONCATENATE($A34,$A$4),Data!$A$2:$S$100,Lookup!K$3,FALSE)),\"\",VLOOKUP(CONCATENATE($A34,$A$4),Data!$A$2:$S$100,Lookup!K$3,FALSE))","v":2891.1950000000002},{"$f":"IF(ISNA(VLOOKUP(CONCATENATE($A34,$A$4),Data!$A$2:$S$100,Lookup!L$3,FALSE)),\"\",VLOOKUP(CONCATENATE($A34,$A$4),Data!$A$2:$S$100,Lookup!L$3,FALSE))","v":628.13199999999995},{"$f":"IF(ISNA(VLOOKUP(CONCATENATE($A34,$A$4),Data!$A$2:$S$100,Lookup!M$3,FALSE)),\"\",VLOOKUP(CONCATENATE($A34,$A$4),Data!$A$2:$S$100,Lookup!M$3,FALSE))","v":220.779},{"$f":"IF(ISNA(VLOOKUP(CONCATENATE($A34,$A$4),Data!$A$2:$S$100,Lookup!N$3,FALSE)),\"\",VLOOKUP(CONCATENATE($A34,$A$4),Data!$A$2:$S$100,Lookup!N$3,FALSE))","v":359.80799999999999},{"$f":"IF(ISNA(VLOOKUP(CONCATENATE($A34,$A$4),Data!$A$2:$S$100,Lookup!O$3,FALSE)),\"\",VLOOKUP(CONCATENATE($A34,$A$4),Data!$A$2:$S$100,Lookup!O$3,FALSE))","v":1130.278},{"$f":"IF(ISNA(VLOOKUP(CONCATENATE($A34,$A$4),Data!$A$2:$S$100,Lookup!P$3,FALSE)),\"\",VLOOKUP(CONCATENATE($A34,$A$4),Data!$A$2:$S$100,Lookup!P$3,FALSE))","v":2760.0430000000001},{"$f":"IF(ISNA(VLOOKUP(CONCATENATE($A34,$A$4),Data!$A$2:$S$100,Lookup!Q$3,FALSE)),\"\",VLOOKUP(CONCATENATE($A34,$A$4),Data!$A$2:$S$100,Lookup!Q$3,FALSE))","v":11592.871999999999},{"$f":"IF(ISNA(VLOOKUP(CONCATENATE($A34,$A$4),Data!$A$2:$S$100,Lookup!R$3,FALSE)),\"\",VLOOKUP(CONCATENATE($A34,$A$4),Data!$A$2:$S$100,Lookup!R$3,FALSE))","v":54.802999999999997},{"$f":"IF(ISNA(VLOOKUP(CONCATENATE($A34,$A$4),Data!$A$2:$S$100,Lookup!S$3,FALSE)),\"\",VLOOKUP(CONCATENATE($A34,$A$4),Data!$A$2:$S$100,Lookup!S$3,FALSE))","v":1475.2954950369051},{"$f":"IF(ISNA(VLOOKUP(CONCATENATE($A34,$A$4),Data!$A$2:$S$100,Lookup!T$3,FALSE)),\"\",VLOOKUP(CONCATENATE($A34,$A$4),Data!$A$2:$S$100,Lookup!T$3,FALSE))","v":114.55229858793146}]
[23,{"$f":"IF(ISNA(VLOOKUP(CONCATENATE($A35,$A$4),Data!$A$2:$S$100,Lookup!C$3,FALSE)),\"\",VLOOKUP(CONCATENATE($A35,$A$4),Data!$A$2:$S$100,Lookup!C$3,FALSE))","v":"Perth Royal Infirmary"},{"$f":"IF(ISNA(VLOOKUP(CONCATENATE($A35,$A$4),Data!$A$2:$S$100,Lookup!D$3,FALSE)),\"\",VLOOKUP(CONCATENATE($A35,$A$4),Data!$A$2:$S$100,Lookup!D$3,FALSE))","v":"T"},{"$f":"IF(ISNA(VLOOKUP(CONCATENATE($A35,$A$4),Data!$A$2:$S$100,Lookup!E$3,FALSE)),\"\",VLOOKUP(CONCATENATE($A35,$A$4),Data!$A$2:$S$100,Lookup!E$3,FALSE))","v":"A2"},{"$f":"IF(ISNA(VLOOKUP(CONCATENATE($A35,$A$4),Data!$A$2:$S$100,Lookup!F$3,FALSE)),\"\",VLOOKUP(CONCATENATE($A35,$A$4),Data!$A$2:$S$100,Lookup!F$3,FALSE))","v":8},{"$f":"IF(ISNA(VLOOKUP(CONCATENATE($A35,$A$4),Data!$A$2:$S$100,Lookup!G$3,FALSE)),\"\",VLOOKUP(CONCATENATE($A35,$A$4),Data!$A$2:$S$100,Lookup!G$3,FALSE))","v":125.22903846153847},{"$f":"IF(ISNA(VLOOKUP(CONCATENATE($A35,$A$4),Data!$A$2:$S$100,Lookup!H$3,FALSE)),\"\",VLOOKUP(CONCATENATE($A35,$A$4),Data!$A$2:$S$100,Lookup!H$3,FALSE))","v":15.653629807692308},{"$f":"IF(ISNA(VLOOKUP(CONCATENATE($A35,$A$4),Data!$A$2:$S$100,Lookup!I$3,FALSE)),\"\",VLOOKUP(CONCATENATE($A35,$A$4),Data!$A$2:$S$100,Lookup!I$3,FALSE))","v":60.829527454905687},{"$f":"IF(ISNA(VLOOKUP(CONCATENATE($A35,$A$4),Data!$A$2:$S$100,Lookup!J$3,FALSE)),\"\",VLOOKUP(CONCATENATE($A35,$A$4),Data!$A$2:$S$100,Lookup!J$3,FALSE))","v":2093.62131},{"$f":"IF(ISNA(VLOOKUP(CONCATENATE($A35,$A$4),Data!$A$2:$S$100,Lookup!K$3,FALSE)),\"\",VLOOKUP(CONCATENATE($A35,$A$4),Data!$A$2:$S$100,Lookup!K$3,FALSE))","v":2577.13906},{"$f":"IF(ISNA(VLOOKUP(CONCATENATE($A35,$A$4),Data!$A$2:$S$100,Lookup!L$3,FALSE)),\"\",VLOOKUP(CONCATENATE($A35,$A$4),Data!$A$2:$S$100,Lookup!L$3,FALSE))","v":241.61649},{"$f":"IF(ISNA(VLOOKUP(CONCATENATE($A35,$A$4),Data!$A$2:$S$100,Lookup!M$3,FALSE)),\"\",VLOOKUP(CONCATENATE($A35,$A$4),Data!$A$2:$S$100,Lookup!M$3,FALSE))","v":253.75411},{"$f":"IF(ISNA(VLOOKUP(CONCATENATE($A35,$A$4),Data!$A$2:$S$100,Lookup!N$3,FALSE)),\"\",VLOOKUP(CONCATENATE($A35,$A$4),Data!$A$2:$S$100,Lookup!N$3,FALSE))","v":1764.18586},{"$f":"IF(ISNA(VLOOKUP(CONCATENATE($A35,$A$4),Data!$A$2:$S$100,Lookup!O$3,FALSE)),\"\",VLOOKUP(CONCATENATE($A35,$A$4),Data!$A$2:$S$100,Lookup!O$3,FALSE))","v":1120.37916},{"$f":"IF(ISNA(VLOOKUP(CONCATENATE($A35,$A$4),Data!$A$2:$S$100,Lookup!P$3,FALSE)),\"\",VLOOKUP(CONCATENATE($A35,$A$4),Data!$A$2:$S$100,Lookup!P$3,FALSE))","v":3370.47},{"$f":"IF(ISNA(VLOOKUP(CONCATENATE($A35,$A$4),Data!$A$2:$S$100,Lookup!Q$3,FALSE)),\"\",VLOOKUP(CONCATENATE($A35,$A$4),Data!$A$2:$S$100,Lookup!Q$3,FALSE))","v":11421.16599},{"$f":"IF(ISNA(VLOOKUP(CONCATENATE($A35,$A$4),Data!$A$2:$S$100,Lookup!R$3,FALSE)),\"\",VLOOKUP(CONCATENATE($A35,$A$4),Data!$A$2:$S$100,Lookup!R$3,FALSE))","v":"-"},{"$f":"IF(ISNA(VLOOKUP(CONCATENATE($A35,$A$4),Data!$A$2:$S$100,Lookup!S$3,FALSE)),\"\",VLOOKUP(CONCATENATE($A35,$A$4),Data!$A$2:$S$100,Lookup!S$3,FALSE))","v":1753.8887960675133},{"$f":"IF(ISNA(VLOOKUP(CONCATENATE($A35,$A$4),Data!$A$2:$S$100,Lookup!T$3,FALSE)),\"\",VLOOKUP(CONCATENATE($A35,$A$4),Data!$A$2:$S$100,Lookup!T$3,FALSE))","v":136.18423816316712}]
[24,{"$f":"IF(ISNA(VLOOKUP(CONCATENATE($A36,$A$4),Data!$A$2:$S$100,Lookup!C$3,FALSE)),\"\",VLOOKUP(CONCATENATE($A36,$A$4),Data!$A$2:$S$100,Lookup!C$3,FALSE))","v":"Queen Margaret Hospital"},{"$f":"IF(ISNA(VLOOKUP(CONCATENATE($A36,$A$4),Data!$A$2:$S$100,Lookup!D$3,FALSE)),\"\",VLOOKUP(CONCATENATE($A36,$A$4),Data!$A$2:$S$100,Lookup!D$3,FALSE))","v":"F"},{"$f":"IF(ISNA(VLOOKUP(CONCATENATE($A36,$A$4),Data!$A$2:$S$100,Lookup!E$3,FALSE)),\"\",VLOOKUP(CONCATENATE($A36,$A$4),Data!$A$2:$S$100,Lookup!E$3,FALSE))","v":"A3"},{"$f":"IF(ISNA(VLOOKUP(CONCATENATE($A36,$A$4),Data!$A$2:$S$100,Lookup!F$3,FALSE)),\"\",VLOOKUP(CONCATENATE($A36,$A$4),Data!$A$2:$S$100,Lookup!F$3,FALSE))","v":8},{"$f":"IF(ISNA(VLOOKUP(CONCATENATE($A36,$A$4),Data!$A$2:$S$100,Lookup!G$3,FALSE)),\"\",VLOOKUP(CONCATENATE($A36,$A$4),Data!$A$2:$S$100,Lookup!G$3,FALSE))","v":150.57692307692307},{"$f":"IF(ISNA(VLOOKUP(CONCATENATE($A36,$A$4),Data!$A$2:$S$100,Lookup!H$3,FALSE)),\"\",VLOOKUP(CONCATENATE($A36,$A$4),Data!$A$2:$S$100,Lookup!H$3,FALSE))","v":18.822115384615383},{"$f":"IF(ISNA(VLOOKUP(CONCATENATE($A36,$A$4),Data!$A$2:$S$100,Lookup!I$3,FALSE)),\"\",VLOOKUP(CONCATENATE($A36,$A$4),Data!$A$2:$S$100,Lookup!I$3,FALSE))","v":73.142165658295568},{"$f":"IF(ISNA(VLOOKUP(CONCATENATE($A36,$A$4),Data!$A$2:$S$100,Lookup!J$3,FALSE)),\"\",VLOOKUP(CONCATENATE($A36,$A$4),Data!$A$2:$S$100,Lookup!J$3,FALSE))","v":1023.016},{"$f":"IF(ISNA(VLOOKUP(CONCATENATE($A36,$A$4),Data!$A$2:$S$100,Lookup!K$3,FALSE)),\"\",VLOOKUP(CONCATENATE($A36,$A$4),Data!$A$2:$S$100,Lookup!K$3,FALSE))","v":1796.5},{"$f":"IF(ISNA(VLOOKUP(CONCATENATE($A36,$A$4),Data!$A$2:$S$100,Lookup!L$3,FALSE)),\"\",VLOOKUP(CONCATENATE($A36,$A$4),Data!$A$2:$S$100,Lookup!L$3,FALSE))","v":212.81800000000001},{"$f":"IF(ISNA(VLOOKUP(CONCATENATE($A36,$A$4),Data!$A$2:$S$100,Lookup!M$3,FALSE)),\"\",VLOOKUP(CONCATENATE($A36,$A$4),Data!$A$2:$S$100,Lookup!M$3,FALSE))","v":610.43700000000001},{"$f":"IF(ISNA(VLOOKUP(CONCATENATE($A36,$A$4),Data!$A$2:$S$100,Lookup!N$3,FALSE)),\"\",VLOOKUP(CONCATENATE($A36,$A$4),Data!$A$2:$S$100,Lookup!N$3,FALSE))","v":26.818999999999999},{"$f":"IF(ISNA(VLOOKUP(CONCATENATE($A36,$A$4),Data!$A$2:$S$100,Lookup!O$3,FALSE)),\"\",VLOOKUP(CONCATENATE($A36,$A$4),Data!$A$2:$S$100,Lookup!O$3,FALSE))","v":1355.7280000000001},{"$f":"IF(ISNA(VLOOKUP(CONCATENATE($A36,$A$4),Data!$A$2:$S$100,Lookup!P$3,FALSE)),\"\",VLOOKUP(CONCATENATE($A36,$A$4),Data!$A$2:$S$100,Lookup!P$3,FALSE))","v":285.584},{"$f":"IF(ISNA(VLOOKUP(CONCATENATE($A36,$A$4),Data!$A$2:$S$100,Lookup!Q$3,FALSE)),\"\",VLOOKUP(CONCATENATE($A36,$A$4),Data!$A$2:$S$100,Lookup!Q$3,FALSE))","v":5310.902},{"$f":"IF(ISNA(VLOOKUP(CONCATENATE($A36,$A$4),Data!$A$2:$S$100,Lookup!R$3,FALSE)),\"\",VLOOKUP(CONCATENATE($A36,$A$4),Data!$A$2:$S$100,Lookup!R$3,FALSE))","v":"-"},{"$f":"IF(ISNA(VLOOKUP(CONCATENATE($A36,$A$4),Data!$A$2:$S$100,Lookup!S$3,FALSE)),\"\",VLOOKUP(CONCATENATE($A36,$A$4),Data!$A$2:$S$100,Lookup!S$3,FALSE))","v":678.27611749680727},{"$f":"IF(ISNA(VLOOKUP(CONCATENATE($A36,$A$4),Data!$A$2:$S$100,Lookup!T$3,FALSE)),\"\",VLOOKUP(CONCATENATE($A36,$A$4),Data!$A$2:$S$100,Lookup!T$3,FALSE))","v":52.66611915914072}]
[25,{"$f":"IF(ISNA(VLOOKUP(CONCATENATE($A37,$A$4),Data!$A$2:$S$100,Lookup!C$3,FALSE)),\"\",VLOOKUP(CONCATENATE($A37,$A$4),Data!$A$2:$S$100,Lookup!C$3,FALSE))","v":"Dr. Gray's, Elgin"},{"$f":"IF(ISNA(VLOOKUP(CONCATENATE($A37,$A$4),Data!$A$2:$S$100,Lookup!D$3,FALSE)),\"\",VLOOKUP(CONCATENATE($A37,$A$4),Data!$A$2:$S$100,Lookup!D$3,FALSE))","v":"N"},{"$f":"IF(ISNA(VLOOKUP(CONCATENATE($A37,$A$4),Data!$A$2:$S$100,Lookup!E$3,FALSE)),\"\",VLOOKUP(CONCATENATE($A37,$A$4),Data!$A$2:$S$100,Lookup!E$3,FALSE))","v":"A3"},{"$f":"IF(ISNA(VLOOKUP(CONCATENATE($A37,$A$4),Data!$A$2:$S$100,Lookup!F$3,FALSE)),\"\",VLOOKUP(CONCATENATE($A37,$A$4),Data!$A$2:$S$100,Lookup!F$3,FALSE))","v":5},{"$f":"IF(ISNA(VLOOKUP(CONCATENATE($A37,$A$4),Data!$A$2:$S$100,Lookup!G$3,FALSE)),\"\",VLOOKUP(CONCATENATE($A37,$A$4),Data!$A$2:$S$100,Lookup!G$3,FALSE))","v":133.11538461538461},{"$f":"IF(ISNA(VLOOKUP(CONCATENATE($A37,$A$4),Data!$A$2:$S$100,Lookup!H$3,FALSE)),\"\",VLOOKUP(CONCATENATE($A37,$A$4),Data!$A$2:$S$100,Lookup!H$3,FALSE))","v":26.623076923076923},{"$f":"IF(ISNA(VLOOKUP(CONCATENATE($A37,$A$4),Data!$A$2:$S$100,Lookup!I$3,FALSE)),\"\",VLOOKUP(CONCATENATE($A37,$A$4),Data!$A$2:$S$100,Lookup!I$3,FALSE))","v":103.45646399728675},{"$f":"IF(ISNA(VLOOKUP(CONCATENATE($A37,$A$4),Data!$A$2:$S$100,Lookup!J$3,FALSE)),\"\",VLOOKUP(CONCATENATE($A37,$A$4),Data!$A$2:$S$100,Lookup!J$3,FALSE))","v":2153.1909999999998},{"$f":"IF(ISNA(VLOOKUP(CONCATENATE($A37,$A$4),Data!$A$2:$S$100,Lookup!K$3,FALSE)),\"\",VLOOKUP(CONCATENATE($A37,$A$4),Data!$A$2:$S$100,Lookup!K$3,FALSE))","v":2358.3960000000002},{"$f":"IF(ISNA(VLOOKUP(CONCATENATE($A37,$A$4),Data!$A$2:$S$100,Lookup!L$3,FALSE)),\"\",VLOOKUP(CONCATENATE($A37,$A$4),Data!$A$2:$S$100,Lookup!L$3,FALSE))","v":-5.6710000000000003},{"$f":"IF(ISNA(VLOOKUP(CONCATENATE($A37,$A$4),Data!$A$2:$S$100,Lookup!M$3,FALSE)),\"\",VLOOKUP(CONCATENATE($A37,$A$4),Data!$A$2:$S$100,Lookup!M$3,FALSE))","v":178.90799999999999},{"$f":"IF(ISNA(VLOOKUP(CONCATENATE($A37,$A$4),Data!$A$2:$S$100,Lookup!N$3,FALSE)),\"\",VLOOKUP(CONCATENATE($A37,$A$4),Data!$A$2:$S$100,Lookup!N$3,FALSE))","v":78.186999999999998},{"$f":"IF(ISNA(VLOOKUP(CONCATENATE($A37,$A$4),Data!$A$2:$S$100,Lookup!O$3,FALSE)),\"\",VLOOKUP(CONCATENATE($A37,$A$4),Data!$A$2:$S$100,Lookup!O$3,FALSE))","v":3037.5160000000001},{"$f":"IF(ISNA(VLOOKUP(CONCATENATE($A37,$A$4),Data!$A$2:$S$100,Lookup!P$3,FALSE)),\"\",VLOOKUP(CONCATENATE($A37,$A$4),Data!$A$2:$S$100,Lookup!P$3,FALSE))","v":1560.105},{"$f":"IF(ISNA(VLOOKUP(CONCATENATE($A37,$A$4),Data!$A$2:$S$100,Lookup!Q$3,FALSE)),\"\",VLOOKUP(CONCATENATE($A37,$A$4),Data!$A$2:$S$100,Lookup!Q$3,FALSE))","v":9360.6319999999996},{"$f":"IF(ISNA(VLOOKUP(CONCATENATE($A37,$A$4),Data!$A$2:$S$100,Lookup!R$3,FALSE)),\"\",VLOOKUP(CONCATENATE($A37,$A$4),Data!$A$2:$S$100,Lookup!R$3,FALSE))","v":"-"},{"$f":"IF(ISNA(VLOOKUP(CONCATENATE($A37,$A$4),Data!$A$2:$S$100,Lookup!S$3,FALSE)),\"\",VLOOKUP(CONCATENATE($A37,$A$4),Data!$A$2:$S$100,Lookup!S$3,FALSE))","v":1352.3016469228546},{"$f":"IF(ISNA(VLOOKUP(CONCATENATE($A37,$A$4),Data!$A$2:$S$100,Lookup!T$3,FALSE)),\"\",VLOOKUP(CONCATENATE($A37,$A$4),Data!$A$2:$S$100,Lookup!T$3,FALSE))","v":105.00219282197645}]
[26,{"$f":"IF(ISNA(VLOOKUP(CONCATENATE($A38,$A$4),Data!$A$2:$S$100,Lookup!C$3,FALSE)),\"\",VLOOKUP(CONCATENATE($A38,$A$4),Data!$A$2:$S$100,Lookup!C$3,FALSE))","v":"Vale of Leven, Alexandria"},{"$f":"IF(ISNA(VLOOKUP(CONCATENATE($A38,$A$4),Data!$A$2:$S$100,Lookup!D$3,FALSE)),\"\",VLOOKUP(CONCATENATE($A38,$A$4),Data!$A$2:$S$100,Lookup!D$3,FALSE))","v":"G"},{"$f":"IF(ISNA(VLOOKUP(CONCATENATE($A38,$A$4),Data!$A$2:$S$100,Lookup!E$3,FALSE)),\"\",VLOOKUP(CONCATENATE($A38,$A$4),Data!$A$2:$S$100,Lookup!E$3,FALSE))","v":"A3"},{"$f":"IF(ISNA(VLOOKUP(CONCATENATE($A38,$A$4),Data!$A$2:$S$100,Lookup!F$3,FALSE)),\"\",VLOOKUP(CONCATENATE($A38,$A$4),Data!$A$2:$S$100,Lookup!F$3,FALSE))","v":3},{"$f":"IF(ISNA(VLOOKUP(CONCATENATE($A38,$A$4),Data!$A$2:$S$100,Lookup!G$3,FALSE)),\"\",VLOOKUP(CONCATENATE($A38,$A$4),Data!$A$2:$S$100,Lookup!G$3,FALSE))","v":30.865384615384617},{"$f":"IF(ISNA(VLOOKUP(CONCATENATE($A38,$A$4),Data!$A$2:$S$100,Lookup!H$3,FALSE)),\"\",VLOOKUP(CONCATENATE($A38,$A$4),Data!$A$2:$S$100,Lookup!H$3,FALSE))","v":10.288461538461538},{"$f":"IF(ISNA(VLOOKUP(CONCATENATE($A38,$A$4),Data!$A$2:$S$100,Lookup!I$3,FALSE)),\"\",VLOOKUP(CONCATENATE($A38,$A$4),Data!$A$2:$S$100,Lookup!I$3,FALSE))","v":39.980647384100259},{"$f":"IF(ISNA(VLOOKUP(CONCATENATE($A38,$A$4),Data!$A$2:$S$100,Lookup!J$3,FALSE)),\"\",VLOOKUP(CONCATENATE($A38,$A$4),Data!$A$2:$S$100,Lookup!J$3,FALSE))","v":589.35599999999999},{"$f":"IF(ISNA(VLOOKUP(CONCATENATE($A38,$A$4),Data!$A$2:$S$100,Lookup!K$3,FALSE)),\"\",VLOOKUP(CONCATENATE($A38,$A$4),Data!$A$2:$S$100,Lookup!K$3,FALSE))","v":715.71500000000003},{"$f":"IF(ISNA(VLOOKUP(CONCATENATE($A38,$A$4),Data!$A$2:$S$100,Lookup!L$3,FALSE)),\"\",VLOOKUP(CONCATENATE($A38,$A$4),Data!$A$2:$S$100,Lookup!L$3,FALSE))","v":"-"},{"$f":"IF(ISNA(VLOOKUP(CONCATENATE($A38,$A$4),Data!$A$2:$S$100,Lookup!M$3,FALSE)),\"\",VLOOKUP(CONCATENATE($A38,$A$4),Data!$A$2:$S$100,Lookup!M$3,FALSE))","v":86.174000000000007},{"$f":"IF(ISNA(VLOOKUP(CONCATENATE($A38,$A$4),Data!$A$2:$S$100,Lookup!N$3,FALSE)),\"\",VLOOKUP(CONCATENATE($A38,$A$4),Data!$A$2:$S$100,Lookup!N$3,FALSE))","v":21.248999999999999},{"$f":"IF(ISNA(VLOOKUP(CONCATENATE($A38,$A$4),Data!$A$2:$S$100,Lookup!O$3,FALSE)),\"\",VLOOKUP(CONCATENATE($A38,$A$4),Data!$A$2:$S$100,Lookup!O$3,FALSE))","v":390.31900000000002},{"$f":"IF(ISNA(VLOOKUP(CONCATENATE($A38,$A$4),Data!$A$2:$S$100,Lookup!P$3,FALSE)),\"\",VLOOKUP(CONCATENATE($A38,$A$4),Data!$A$2:$S$100,Lookup!P$3,FALSE))","v":482.02600000000001},{"$f":"IF(ISNA(VLOOKUP(CONCATENATE($A38,$A$4),Data!$A$2:$S$100,Lookup!Q$3,FALSE)),\"\",VLOOKUP(CONCATENATE($A38,$A$4),Data!$A$2:$S$100,Lookup!Q$3,FALSE))","v":2284.8389999999999},{"$f":"IF(ISNA(VLOOKUP(CONCATENATE($A38,$A$4),Data!$A$2:$S$100,Lookup!R$3,FALSE)),\"\",VLOOKUP(CONCATENATE($A38,$A$4),Data!$A$2:$S$100,Lookup!R$3,FALSE))","v":"-"},{"$f":"IF(ISNA(VLOOKUP(CONCATENATE($A38,$A$4),Data!$A$2:$S$100,Lookup!S$3,FALSE)),\"\",VLOOKUP(CONCATENATE($A38,$A$4),Data!$A$2:$S$100,Lookup!S$3,FALSE))","v":1423.5757009345793},{"$f":"IF(ISNA(VLOOKUP(CONCATENATE($A38,$A$4),Data!$A$2:$S$100,Lookup!T$3,FALSE)),\"\",VLOOKUP(CONCATENATE($A38,$A$4),Data!$A$2:$S$100,Lookup!T$3,FALSE))","v":110.53641070862376}]
[27,{"$f":"IF(ISNA(VLOOKUP(CONCATENATE($A39,$A$4),Data!$A$2:$S$100,Lookup!C$3,FALSE)),\"\",VLOOKUP(CONCATENATE($A39,$A$4),Data!$A$2:$S$100,Lookup!C$3,FALSE))","v":"Western Isles, Stornoway"},{"$f":"IF(ISNA(VLOOKUP(CONCATENATE($A39,$A$4),Data!$A$2:$S$100,Lookup!D$3,FALSE)),\"\",VLOOKUP(CONCATENATE($A39,$A$4),Data!$A$2:$S$100,Lookup!D$3,FALSE))","v":"W"},{"$f":"IF(ISNA(VLOOKUP(CONCATENATE($A39,$A$4),Data!$A$2:$S$100,Lookup!E$3,FALSE)),\"\",VLOOKUP(CONCATENATE($A39,$A$4),Data!$A$2:$S$100,Lookup!E$3,FALSE))","v":"A3"},{"$f":"IF(ISNA(VLOOKUP(CONCATENATE($A39,$A$4),Data!$A$2:$S$100,Lookup!F$3,FALSE)),\"\",VLOOKUP(CONCATENATE($A39,$A$4),Data!$A$2:$S$100,Lookup!F$3,FALSE))","v":2},{"$f":"IF(ISNA(VLOOKUP(CONCATENATE($A39,$A$4),Data!$A$2:$S$100,Lookup!G$3,FALSE)),\"\",VLOOKUP(CONCATENATE($A39,$A$4),Data!$A$2:$S$100,Lookup!G$3,FALSE))","v":71.557692307692307},{"$f":"IF(ISNA(VLOOKUP(CONCATENATE($A39,$A$4),Data!$A$2:$S$100,Lookup!H$3,FALSE)),\"\",VLOOKUP(CONCATENATE($A39,$A$4),Data!$A$2:$S$100,Lookup!H$3,FALSE))","v":35.778846153846153},{"$f":"IF(ISNA(VLOOKUP(CONCATENATE($A39,$A$4),Data!$A$2:$S$100,Lookup!I$3,FALSE)),\"\",VLOOKUP(CONCATENATE($A39,$A$4),Data!$A$2:$S$100,Lookup!I$3,FALSE))","v":139.03550366003466},{"$f":"IF(ISNA(VLOOKUP(CONCATENATE($A39,$A$4),Data!$A$2:$S$100,Lookup!J$3,FALSE)),\"\",VLOOKUP(CONCATENATE($A39,$A$4),Data!$A$2:$S$100,Lookup!J$3,FALSE))","v":"-"},{"$f":"IF(ISNA(VLOOKUP(CONCATENATE($A39,$A$4),Data!$A$2:$S$100,Lookup!K$3,FALSE)),\"\",VLOOKUP(CONCATENATE($A39,$A$4),Data!$A$2:$S$100,Lookup!K$3,FALSE))","v":1001.8131500000001},{"$f":"IF(ISNA(VLOOKUP(CONCATENATE($A39,$A$4),Data!$A$2:$S$100,Lookup!L$3,FALSE)),\"\",VLOOKUP(CONCATENATE($A39,$A$4),Data!$A$2:$S$100,Lookup!L$3,FALSE))","v":960.66581999999994},{"$f":"IF(ISNA(VLOOKUP(CONCATENATE($A39,$A$4),Data!$A$2:$S$100,Lookup!M$3,FALSE)),\"\",VLOOKUP(CONCATENATE($A39,$A$4),Data!$A$2:$S$100,Lookup!M$3,FALSE))","v":17.65606},{"$f":"IF(ISNA(VLOOKUP(CONCATENATE($A39,$A$4),Data!$A$2:$S$100,Lookup!N$3,FALSE)),\"\",VLOOKUP(CONCATENATE($A39,$A$4),Data!$A$2:$S$100,Lookup!N$3,FALSE))","v":"-"},{"$f":"IF(ISNA(VLOOKUP(CONCATENATE($A39,$A$4),Data!$A$2:$S$100,Lookup!O$3,FALSE)),\"\",VLOOKUP(CONCATENATE($A39,$A$4),Data!$A$2:$S$100,Lookup!O$3,FALSE))","v":332.19690000000003},{"$f":"IF(ISNA(VLOOKUP(CONCATENATE($A39,$A$4),Data!$A$2:$S$100,Lookup!P$3,FALSE)),\"\",VLOOKUP(CONCATENATE($A39,$A$4),Data!$A$2:$S$100,Lookup!P$3,FALSE))","v":925.22900000000004},{"$f":"IF(ISNA(VLOOKUP(CONCATENATE($A39,$A$4),Data!$A$2:$S$100,Lookup!Q$3,FALSE)),\"\",VLOOKUP(CONCATENATE($A39,$A$4),Data!$A$2:$S$100,Lookup!Q$3,FALSE))","v":3237.5609300000001},{"$f":"IF(ISNA(VLOOKUP(CONCATENATE($A39,$A$4),Data!$A$2:$S$100,Lookup!R$3,FALSE)),\"\",VLOOKUP(CONCATENATE($A39,$A$4),Data!$A$2:$S$100,Lookup!R$3,FALSE))","v":"-"},{"$f":"IF(ISNA(VLOOKUP(CONCATENATE($A39,$A$4),Data!$A$2:$S$100,Lookup!S$3,FALSE)),\"\",VLOOKUP(CONCATENATE($A39,$A$4),Data!$A$2:$S$100,Lookup!S$3,FALSE))","v":870.07818597151311},{"$f":"IF(ISNA(VLOOKUP(CONCATENATE($A39,$A$4),Data!$A$2:$S$100,Lookup!T$3,FALSE)),\"\",VLOOKUP(CONCATENATE($A39,$A$4),Data!$A$2:$S$100,Lookup!T$3,FALSE))","v":67.558978177291365}]
[28,{"$f":"IF(ISNA(VLOOKUP(CONCATENATE($A40,$A$4),Data!$A$2:$S$100,Lookup!C$3,FALSE)),\"\",VLOOKUP(CONCATENATE($A40,$A$4),Data!$A$2:$S$100,Lookup!C$3,FALSE))","v":"Stracathro"},{"$f":"IF(ISNA(VLOOKUP(CONCATENATE($A40,$A$4),Data!$A$2:$S$100,Lookup!D$3,FALSE)),\"\",VLOOKUP(CONCATENATE($A40,$A$4),Data!$A$2:$S$100,Lookup!D$3,FALSE))","v":"T"},{"$f":"IF(ISNA(VLOOKUP(CONCATENATE($A40,$A$4),Data!$A$2:$S$100,Lookup!E$3,FALSE)),\"\",VLOOKUP(CONCATENATE($A40,$A$4),Data!$A$2:$S$100,Lookup!E$3,FALSE))","v":"A3"},{"$f":"IF(ISNA(VLOOKUP(CONCATENATE($A40,$A$4),Data!$A$2:$S$100,Lookup!F$3,FALSE)),\"\",VLOOKUP(CONCATENATE($A40,$A$4),Data!$A$2:$S$100,Lookup!F$3,FALSE))","v":4},{"$f":"IF(ISNA(VLOOKUP(CONCATENATE($A40,$A$4),Data!$A$2:$S$100,Lookup!G$3,FALSE)),\"\",VLOOKUP(CONCATENATE($A40,$A$4),Data!$A$2:$S$100,Lookup!G$3,FALSE))","v":100.97711538461539},{"$f":"IF(ISNA(VLOOKUP(CONCATENATE($A40,$A$4),Data!$A$2:$S$100,Lookup!H$3,FALSE)),\"\",VLOOKUP(CONCATENATE($A40,$A$4),Data!$A$2:$S$100,Lookup!H$3,FALSE))","v":25.244278846153847},{"$f":"IF(ISNA(VLOOKUP(CONCATENATE($A40,$A$4),Data!$A$2:$S$100,Lookup!I$3,FALSE)),\"\",VLOOKUP(CONCATENATE($A40,$A$4),Data!$A$2:$S$100,Lookup!I$3,FALSE))","v":98.098496771452105},{"$f":"IF(ISNA(VLOOKUP(CONCATENATE($A40,$A$4),Data!$A$2:$S$100,Lookup!J$3,FALSE)),\"\",VLOOKUP(CONCATENATE($A40,$A$4),Data!$A$2:$S$100,Lookup!J$3,FALSE))","v":1688.1711399999999},{"$f":"IF(ISNA(VLOOKUP(CONCATENATE($A40,$A$4),Data!$A$2:$S$100,Lookup!K$3,FALSE)),\"\",VLOOKUP(CONCATENATE($A40,$A$4),Data!$A$2:$S$100,Lookup!K$3,FALSE))","v":1194.40569},{"$f":"IF(ISNA(VLOOKUP(CONCATENATE($A40,$A$4),Data!$A$2:$S$100,Lookup!L$3,FALSE)),\"\",VLOOKUP(CONCATENATE($A40,$A$4),Data!$A$2:$S$100,Lookup!L$3,FALSE))","v":84.979860000000002},{"$f":"IF(ISNA(VLOOKUP(CONCATENATE($A40,$A$4),Data!$A$2:$S$100,Lookup!M$3,FALSE)),\"\",VLOOKUP(CONCATENATE($A40,$A$4),Data!$A$2:$S$100,Lookup!M$3,FALSE))","v":77.469920000000002},{"$f":"IF(ISNA(VLOOKUP(CONCATENATE($A40,$A$4),Data!$A$2:$S$100,Lookup!N$3,FALSE)),\"\",VLOOKUP(CONCATENATE($A40,$A$4),Data!$A$2:$S$100,Lookup!N$3,FALSE))","v":261.01677999999998},{"$f":"IF(ISNA(VLOOKUP(CONCATENATE($A40,$A$4),Data!$A$2:$S$100,Lookup!O$3,FALSE)),\"\",VLOOKUP(CONCATENATE($A40,$A$4),Data!$A$2:$S$100,Lookup!O$3,FALSE))","v":961.93140000000005},{"$f":"IF(ISNA(VLOOKUP(CONCATENATE($A40,$A$4),Data!$A$2:$S$100,Lookup!P$3,FALSE)),\"\",VLOOKUP(CONCATENATE($A40,$A$4),Data!$A$2:$S$100,Lookup!P$3,FALSE))","v":3942.3249999999998},{"$f":"IF(ISNA(VLOOKUP(CONCATENATE($A40,$A$4),Data!$A$2:$S$100,Lookup!Q$3,FALSE)),\"\",VLOOKUP(CONCATENATE($A40,$A$4),Data!$A$2:$S$100,Lookup!Q$3,FALSE))","v":8210.2997900000009},{"$f":"IF(ISNA(VLOOKUP(CONCATENATE($A40,$A$4),Data!$A$2:$S$100,Lookup!R$3,FALSE)),\"\",VLOOKUP(CONCATENATE($A40,$A$4),Data!$A$2:$S$100,Lookup!R$3,FALSE))","v":"-"},{"$f":"IF(ISNA(VLOOKUP(CONCATENATE($A40,$A$4),Data!$A$2:$S$100,Lookup!S$3,FALSE)),\"\",VLOOKUP(CONCATENATE($A40,$A$4),Data!$A$2:$S$100,Lookup!S$3,FALSE))","v":1563.6253816077901},{"$f":"IF(ISNA(VLOOKUP(CONCATENATE($A40,$A$4),Data!$A$2:$S$100,Lookup!T$3,FALSE)),\"\",VLOOKUP(CONCATENATE($A40,$A$4),Data!$A$2:$S$100,Lookup!T$3,FALSE))","v":121.41085104386032}]
[29,{"$f":"IF(ISNA(VLOOKUP(CONCATENATE($A41,$A$4),Data!$A$2:$S$100,Lookup!C$3,FALSE)),\"\",VLOOKUP(CONCATENATE($A41,$A$4),Data!$A$2:$S$100,Lookup!C$3,FALSE))","v":"Lorn & Islands District G.H."},{"$f":"IF(ISNA(VLOOKUP(CONCATENATE($A41,$A$4),Data!$A$2:$S$100,Lookup!D$3,FALSE)),\"\",VLOOKUP(CONCATENATE($A41,$A$4),Data!$A$2:$S$100,Lookup!D$3,FALSE))","v":"H"},{"$f":"IF(ISNA(VLOOKUP(CONCATENATE($A41,$A$4),Data!$A$2:$S$100,Lookup!E$3,FALSE)),\"\",VLOOKUP(CONCATENATE($A41,$A$4),Data!$A$2:$S$100,Lookup!E$3,FALSE))","v":"A3"},{"$f":"IF(ISNA(VLOOKUP(CONCATENATE($A41,$A$4),Data!$A$2:$S$100,Lookup!F$3,FALSE)),\"\",VLOOKUP(CONCATENATE($A41,$A$4),Data!$A$2:$S$100,Lookup!F$3,FALSE))","v":1},{"$f":"IF(ISNA(VLOOKUP(CONCATENATE($A41,$A$4),Data!$A$2:$S$100,Lookup!G$3,FALSE)),\"\",VLOOKUP(CONCATENATE($A41,$A$4),Data!$A$2:$S$100,Lookup!G$3,FALSE))","v":10.640384615384615},{"$f":"IF(ISNA(VLOOKUP(CONCATENATE($A41,$A$4),Data!$A$2:$S$100,Lookup!H$3,FALSE)),\"\",VLOOKUP(CONCATENATE($A41,$A$4),Data!$A$2:$S$100,Lookup!H$3,FALSE))","v":10.640384615384615},{"$f":"IF(ISNA(VLOOKUP(CONCATENATE($A41,$A$4),Data!$A$2:$S$100,Lookup!I$3,FALSE)),\"\",VLOOKUP(CONCATENATE($A41,$A$4),Data!$A$2:$S$100,Lookup!I$3,FALSE))","v":41.34820971518257},{"$f":"IF(ISNA(VLOOKUP(CONCATENATE($A41,$A$4),Data!$A$2:$S$100,Lookup!J$3,FALSE)),\"\",VLOOKUP(CONCATENATE($A41,$A$4),Data!$A$2:$S$100,Lookup!J$3,FALSE))","v":565.91922},{"$f":"IF(ISNA(VLOOKUP(CONCATENATE($A41,$A$4),Data!$A$2:$S$100,Lookup!K$3,FALSE)),\"\",VLOOKUP(CONCATENATE($A41,$A$4),Data!$A$2:$S$100,Lookup!K$3,FALSE))","v":597.35752000000002},{"$f":"IF(ISNA(VLOOKUP(CONCATENATE($A41,$A$4),Data!$A$2:$S$100,Lookup!L$3,FALSE)),\"\",VLOOKUP(CONCATENATE($A41,$A$4),Data!$A$2:$S$100,Lookup!L$3,FALSE))","v":25.8718},{"$f":"IF(ISNA(VLOOKUP(CONCATENATE($A41,$A$4),Data!$A$2:$S$100,Lookup!M$3,FALSE)),\"\",VLOOKUP(CONCATENATE($A41,$A$4),Data!$A$2:$S$100,Lookup!M$3,FALSE))","v":89.605720000000005},{"$f":"IF(ISNA(VLOOKUP(CONCATENATE($A41,$A$4),Data!$A$2:$S$100,Lookup!N$3,FALSE)),\"\",VLOOKUP(CONCATENATE($A41,$A$4),Data!$A$2:$S$100,Lookup!N$3,FALSE))","v":7.9659999999999995E-2},{"$f":"IF(ISNA(VLOOKUP(CONCATENATE($A41,$A$4),Data!$A$2:$S$100,Lookup!O$3,FALSE)),\"\",VLOOKUP(CONCATENATE($A41,$A$4),Data!$A$2:$S$100,Lookup!O$3,FALSE))","v":127.31266000000001},{"$f":"IF(ISNA(VLOOKUP(CONCATENATE($A41,$A$4),Data!$A$2:$S$100,Lookup!P$3,FALSE)),\"\",VLOOKUP(CONCATENATE($A41,$A$4),Data!$A$2:$S$100,Lookup!P$3,FALSE))","v":386.91165000000001},{"$f":"IF(ISNA(VLOOKUP(CONCATENATE($A41,$A$4),Data!$A$2:$S$100,Lookup!Q$3,FALSE)),\"\",VLOOKUP(CONCATENATE($A41,$A$4),Data!$A$2:$S$100,Lookup!Q$3,FALSE))","v":1793.0582300000001},{"$f":"IF(ISNA(VLOOKUP(CONCATENATE($A41,$A$4),Data!$A$2:$S$100,Lookup!R$3,FALSE)),\"\",VLOOKUP(CONCATENATE($A41,$A$4),Data!$A$2:$S$100,Lookup!R$3,FALSE))","v":"-"},{"$f":"IF(ISNA(VLOOKUP(CONCATENATE($A41,$A$4),Data!$A$2:$S$100,Lookup!S$3,FALSE)),\"\",VLOOKUP(CONCATENATE($A41,$A$4),Data!$A$2:$S$100,Lookup!S$3,FALSE))","v":3240.6619013193567},{"$f":"IF(ISNA(VLOOKUP(CONCATENATE($A41,$A$4),Data!$A$2:$S$100,Lookup!T$3,FALSE)),\"\",VLOOKUP(CONCATENATE($A41,$A$4),Data!$A$2:$S$100,Lookup!T$3,FALSE))","v":251.62773897928989}]
[30,{"$f":"IF(ISNA(VLOOKUP(CONCATENATE($A42,$A$4),Data!$A$2:$S$100,Lookup!C$3,FALSE)),\"\",VLOOKUP(CONCATENATE($A42,$A$4),Data!$A$2:$S$100,Lookup!C$3,FALSE))","v":"Balfour, Kirkwall"},{"$f":"IF(ISNA(VLOOKUP(CONCATENATE($A42,$A$4),Data!$A$2:$S$100,Lookup!D$3,FALSE)),\"\",VLOOKUP(CONCATENATE($A42,$A$4),Data!$A$2:$S$100,Lookup!D$3,FALSE))","v":"R"},{"$f":"IF(ISNA(VLOOKUP(CONCATENATE($A42,$A$4),Data!$A$2:$S$100,Lookup!E$3,FALSE)),\"\",VLOOKUP(CONCATENATE($A42,$A$4),Data!$A$2:$S$100,Lookup!E$3,FALSE))","v":"A3"},{"$f":"IF(ISNA(VLOOKUP(CONCATENATE($A42,$A$4),Data!$A$2:$S$100,Lookup!F$3,FALSE)),\"\",VLOOKUP(CONCATENATE($A42,$A$4),Data!$A$2:$S$100,Lookup!F$3,FALSE))","v":1.79},{"$f":"IF(ISNA(VLOOKUP(CONCATENATE($A42,$A$4),Data!$A$2:$S$100,Lookup!G$3,FALSE)),\"\",VLOOKUP(CONCATENATE($A42,$A$4),Data!$A$2:$S$100,Lookup!G$3,FALSE))","v":40.213461538461537},{"$f":"IF(ISNA(VLOOKUP(CONCATENATE($A42,$A$4),Data!$A$2:$S$100,Lookup!H$3,FALSE)),\"\",VLOOKUP(CONCATENATE($A42,$A$4),Data!$A$2:$S$100,Lookup!H$3,FALSE))","v":22.465620971207564},{"$f":"IF(ISNA(VLOOKUP(CONCATENATE($A42,$A$4),Data!$A$2:$S$100,Lookup!I$3,FALSE)),\"\",VLOOKUP(CONCATENATE($A42,$A$4),Data!$A$2:$S$100,Lookup!I$3,FALSE))","v":87.300717114699594},{"$f":"IF(ISNA(VLOOKUP(CONCATENATE($A42,$A$4),Data!$A$2:$S$100,Lookup!J$3,FALSE)),\"\",VLOOKUP(CONCATENATE($A42,$A$4),Data!$A$2:$S$100,Lookup!J$3,FALSE))","v":928.63031000000001},{"$f":"IF(ISNA(VLOOKUP(CONCATENATE($A42,$A$4),Data!$A$2:$S$100,Lookup!K$3,FALSE)),\"\",VLOOKUP(CONCATENATE($A42,$A$4),Data!$A$2:$S$100,Lookup!K$3,FALSE))","v":599.07611999999995},{"$f":"IF(ISNA(VLOOKUP(CONCATENATE($A42,$A$4),Data!$A$2:$S$100,Lookup!L$3,FALSE)),\"\",VLOOKUP(CONCATENATE($A42,$A$4),Data!$A$2:$S$100,Lookup!L$3,FALSE))","v":0.3029},{"$f":"IF(ISNA(VLOOKUP(CONCATENATE($A42,$A$4),Data!$A$2:$S$100,Lookup!M$3,FALSE)),\"\",VLOOKUP(CONCATENATE($A42,$A$4),Data!$A$2:$S$100,Lookup!M$3,FALSE))","v":0.75499000000000005},{"$f":"IF(ISNA(VLOOKUP(CONCATENATE($A42,$A$4),Data!$A$2:$S$100,Lookup!N$3,FALSE)),\"\",VLOOKUP(CONCATENATE($A42,$A$4),Data!$A$2:$S$100,Lookup!N$3,FALSE))","v":143.82139000000001},{"$f":"IF(ISNA(VLOOKUP(CONCATENATE($A42,$A$4),Data!$A$2:$S$100,Lookup!O$3,FALSE)),\"\",VLOOKUP(CONCATENATE($A42,$A$4),Data!$A$2:$S$100,Lookup!O$3,FALSE))","v":119.85944000000001},{"$f":"IF(ISNA(VLOOKUP(CONCATENATE($A42,$A$4),Data!$A$2:$S$100,Lookup!P$3,FALSE)),\"\",VLOOKUP(CONCATENATE($A42,$A$4),Data!$A$2:$S$100,Lookup!P$3,FALSE))","v":591.50689999999997},{"$f":"IF(ISNA(VLOOKUP(CONCATENATE($A42,$A$4),Data!$A$2:$S$100,Lookup!Q$3,FALSE)),\"\",VLOOKUP(CONCATENATE($A42,$A$4),Data!$A$2:$S$100,Lookup!Q$3,FALSE))","v":2383.9520499999999},{"$f":"IF(ISNA(VLOOKUP(CONCATENATE($A42,$A$4),Data!$A$2:$S$100,Lookup!R$3,FALSE)),\"\",VLOOKUP(CONCATENATE($A42,$A$4),Data!$A$2:$S$100,Lookup!R$3,FALSE))","v":"-"},{"$f":"IF(ISNA(VLOOKUP(CONCATENATE($A42,$A$4),Data!$A$2:$S$100,Lookup!S$3,FALSE)),\"\",VLOOKUP(CONCATENATE($A42,$A$4),Data!$A$2:$S$100,Lookup!S$3,FALSE))","v":1140.0468891970734},{"$f":"IF(ISNA(VLOOKUP(CONCATENATE($A42,$A$4),Data!$A$2:$S$100,Lookup!T$3,FALSE)),\"\",VLOOKUP(CONCATENATE($A42,$A$4),Data!$A$2:$S$100,Lookup!T$3,FALSE))","v":88.5212434355591}]
[31,{"$f":"IF(ISNA(VLOOKUP(CONCATENATE($A43,$A$4),Data!$A$2:$S$100,Lookup!C$3,FALSE)),\"\",VLOOKUP(CONCATENATE($A43,$A$4),Data!$A$2:$S$100,Lookup!C$3,FALSE))","v":"Gilbert Bain, Lerwick"},{"$f":"IF(ISNA(VLOOKUP(CONCATENATE($A43,$A$4),Data!$A$2:$S$100,Lookup!D$3,FALSE)),\"\",VLOOKUP(CONCATENATE($A43,$A$4),Data!$A$2:$S$100,Lookup!D$3,FALSE))","v":"Z"},{"$f":"IF(ISNA(VLOOKUP(CONCATENATE($A43,$A$4),Data!$A$2:$S$100,Lookup!E$3,FALSE)),\"\",VLOOKUP(CONCATENATE($A43,$A$4),Data!$A$2:$S$100,Lookup!E$3,FALSE))","v":"A3"},{"$f":"IF(ISNA(VLOOKUP(CONCATENATE($A43,$A$4),Data!$A$2:$S$100,Lookup!F$3,FALSE)),\"\",VLOOKUP(CONCATENATE($A43,$A$4),Data!$A$2:$S$100,Lookup!F$3,FALSE))","v":2},{"$f":"IF(ISNA(VLOOKUP(CONCATENATE($A43,$A$4),Data!$A$2:$S$100,Lookup!G$3,FALSE)),\"\",VLOOKUP(CONCATENATE($A43,$A$4),Data!$A$2:$S$100,Lookup!G$3,FALSE))","v":19.71153846153846},{"$f":"IF(ISNA(VLOOKUP(CONCATENATE($A43,$A$4),Data!$A$2:$S$100,Lookup!H$3,FALSE)),\"\",VLOOKUP(CONCATENATE($A43,$A$4),Data!$A$2:$S$100,Lookup!H$3,FALSE))","v":9.8557692307692299},{"$f":"IF(ISNA(VLOOKUP(CONCATENATE($A43,$A$4),Data!$A$2:$S$100,Lookup!I$3,FALSE)),\"\",VLOOKUP(CONCATENATE($A43,$A$4),Data!$A$2:$S$100,Lookup!I$3,FALSE))","v":38.299218288507255},{"$f":"IF(ISNA(VLOOKUP(CONCATENATE($A43,$A$4),Data!$A$2:$S$100,Lookup!J$3,FALSE)),\"\",VLOOKUP(CONCATENATE($A43,$A$4),Data!$A$2:$S$100,Lookup!J$3,FALSE))","v":724.80899999999997},{"$f":"IF(ISNA(VLOOKUP(CONCATENATE($A43,$A$4),Data!$A$2:$S$100,Lookup!K$3,FALSE)),\"\",VLOOKUP(CONCATENATE($A43,$A$4),Data!$A$2:$S$100,Lookup!K$3,FALSE))","v":121.13},{"$f":"IF(ISNA(VLOOKUP(CONCATENATE($A43,$A$4),Data!$A$2:$S$100,Lookup!L$3,FALSE)),\"\",VLOOKUP(CONCATENATE($A43,$A$4),Data!$A$2:$S$100,Lookup!L$3,FALSE))","v":850.01199999999994},{"$f":"IF(ISNA(VLOOKUP(CONCATENATE($A43,$A$4),Data!$A$2:$S$100,Lookup!M$3,FALSE)),\"\",VLOOKUP(CONCATENATE($A43,$A$4),Data!$A$2:$S$100,Lookup!M$3,FALSE))","v":18.073},{"$f":"IF(ISNA(VLOOKUP(CONCATENATE($A43,$A$4),Data!$A$2:$S$100,Lookup!N$3,FALSE)),\"\",VLOOKUP(CONCATENATE($A43,$A$4),Data!$A$2:$S$100,Lookup!N$3,FALSE))","v":0.51200000000000001},{"$f":"IF(ISNA(VLOOKUP(CONCATENATE($A43,$A$4),Data!$A$2:$S$100,Lookup!O$3,FALSE)),\"\",VLOOKUP(CONCATENATE($A43,$A$4),Data!$A$2:$S$100,Lookup!O$3,FALSE))","v":245.744},{"$f":"IF(ISNA(VLOOKUP(CONCATENATE($A43,$A$4),Data!$A$2:$S$100,Lookup!P$3,FALSE)),\"\",VLOOKUP(CONCATENATE($A43,$A$4),Data!$A$2:$S$100,Lookup!P$3,FALSE))","v":1193.3679999999999},{"$f":"IF(ISNA(VLOOKUP(CONCATENATE($A43,$A$4),Data!$A$2:$S$100,Lookup!Q$3,FALSE)),\"\",VLOOKUP(CONCATENATE($A43,$A$4),Data!$A$2:$S$100,Lookup!Q$3,FALSE))","v":3153.6480000000001},{"$f":"IF(ISNA(VLOOKUP(CONCATENATE($A43,$A$4),Data!$A$2:$S$100,Lookup!R$3,FALSE)),\"\",VLOOKUP(CONCATENATE($A43,$A$4),Data!$A$2:$S$100,Lookup!R$3,FALSE))","v":16.3},{"$f":"IF(ISNA(VLOOKUP(CONCATENATE($A43,$A$4),Data!$A$2:$S$100,Lookup!S$3,FALSE)),\"\",VLOOKUP(CONCATENATE($A43,$A$4),Data!$A$2:$S$100,Lookup!S$3,FALSE))","v":3076.7297560975608},{"$f":"IF(ISNA(VLOOKUP(CONCATENATE($A43,$A$4),Data!$A$2:$S$100,Lookup!T$3,FALSE)),\"\",VLOOKUP(CONCATENATE($A43,$A$4),Data!$A$2:$S$100,Lookup!T$3,FALSE))","v":238.89889644517945}]
[32,{"$f":"IF(ISNA(VLOOKUP(CONCATENATE($A44,$A$4),Data!$A$2:$S$100,Lookup!C$3,FALSE)),\"\",VLOOKUP(CONCATENATE($A44,$A$4),Data!$A$2:$S$100,Lookup!C$3,FALSE))","v":"Galloway Community Hospital"},{"$f":"IF(ISNA(VLOOKUP(CONCATENATE($A44,$A$4),Data!$A$2:$S$100,Lookup!D$3,FALSE)),\"\",VLOOKUP(CONCATENATE($A44,$A$4),Data!$A$2:$S$100,Lookup!D$3,FALSE))","v":"Y"},{"$f":"IF(ISNA(VLOOKUP(CONCATENATE($A44,$A$4),Data!$A$2:$S$100,Lookup!E$3,FALSE)),\"\",VLOOKUP(CONCATENATE($A44,$A$4),Data!$A$2:$S$100,Lookup!E$3,FALSE))","v":"A3"},{"$f":"IF(ISNA(VLOOKUP(CONCATENATE($A44,$A$4),Data!$A$2:$S$100,Lookup!F$3,FALSE)),\"\",VLOOKUP(CONCATENATE($A44,$A$4),Data!$A$2:$S$100,Lookup!F$3,FALSE))","v":1},{"$f":"IF(ISNA(VLOOKUP(CONCATENATE($A44,$A$4),Data!$A$2:$S$100,Lookup!G$3,FALSE)),\"\",VLOOKUP(CONCATENATE($A44,$A$4),Data!$A$2:$S$100,Lookup!G$3,FALSE))","v":9.7115384615384617},{"$f":"IF(ISNA(VLOOKUP(CONCATENATE($A44,$A$4),Data!$A$2:$S$100,Lookup!H$3,FALSE)),\"\",VLOOKUP(CONCATENATE($A44,$A$4),Data!$A$2:$S$100,Lookup!H$3,FALSE))","v":9.7115384615384617},{"$f":"IF(ISNA(VLOOKUP(CONCATENATE($A44,$A$4),Data!$A$2:$S$100,Lookup!I$3,FALSE)),\"\",VLOOKUP(CONCATENATE($A44,$A$4),Data!$A$2:$S$100,Lookup!I$3,FALSE))","v":37.73874192330959},{"$f":"IF(ISNA(VLOOKUP(CONCATENATE($A44,$A$4),Data!$A$2:$S$100,Lookup!J$3,FALSE)),\"\",VLOOKUP(CONCATENATE($A44,$A$4),Data!$A$2:$S$100,Lookup!J$3,FALSE))","v":728.79700000000003},{"$f":"IF(ISNA(VLOOKUP(CONCATENATE($A44,$A$4),Data!$A$2:$S$100,Lookup!K$3,FALSE)),\"\",VLOOKUP(CONCATENATE($A44,$A$4),Data!$A$2:$S$100,Lookup!K$3,FALSE))","v":537.28399999999999},{"$f":"IF(ISNA(VLOOKUP(CONCATENATE($A44,$A$4),Data!$A$2:$S$100,Lookup!L$3,FALSE)),\"\",VLOOKUP(CONCATENATE($A44,$A$4),Data!$A$2:$S$100,Lookup!L$3,FALSE))","v":"-"},{"$f":"IF(ISNA(VLOOKUP(CONCATENATE($A44,$A$4),Data!$A$2:$S$100,Lookup!M$3,FALSE)),\"\",VLOOKUP(CONCATENATE($A44,$A$4),Data!$A$2:$S$100,Lookup!M$3,FALSE))","v":17.138999999999999},{"$f":"IF(ISNA(VLOOKUP(CONCATENATE($A44,$A$4),Data!$A$2:$S$100,Lookup!N$3,FALSE)),\"\",VLOOKUP(CONCATENATE($A44,$A$4),Data!$A$2:$S$100,Lookup!N$3,FALSE))","v":3.8380000000000001},{"$f":"IF(ISNA(VLOOKUP(CONCATENATE($A44,$A$4),Data!$A$2:$S$100,Lookup!O$3,FALSE)),\"\",VLOOKUP(CONCATENATE($A44,$A$4),Data!$A$2:$S$100,Lookup!O$3,FALSE))","v":98.078999999999994},{"$f":"IF(ISNA(VLOOKUP(CONCATENATE($A44,$A$4),Data!$A$2:$S$100,Lookup!P$3,FALSE)),\"\",VLOOKUP(CONCATENATE($A44,$A$4),Data!$A$2:$S$100,Lookup!P$3,FALSE))","v":361.89100000000002},{"$f":"IF(ISNA(VLOOKUP(CONCATENATE($A44,$A$4),Data!$A$2:$S$100,Lookup!Q$3,FALSE)),\"\",VLOOKUP(CONCATENATE($A44,$A$4),Data!$A$2:$S$100,Lookup!Q$3,FALSE))","v":1747.028},{"$f":"IF(ISNA(VLOOKUP(CONCATENATE($A44,$A$4),Data!$A$2:$S$100,Lookup!R$3,FALSE)),\"\",VLOOKUP(CONCATENATE($A44,$A$4),Data!$A$2:$S$100,Lookup!R$3,FALSE))","v":"-"},{"$f":"IF(ISNA(VLOOKUP(CONCATENATE($A44,$A$4),Data!$A$2:$S$100,Lookup!S$3,FALSE)),\"\",VLOOKUP(CONCATENATE($A44,$A$4),Data!$A$2:$S$100,Lookup!S$3,FALSE))","v":3459.4613861386138},{"$f":"IF(ISNA(VLOOKUP(CONCATENATE($A44,$A$4),Data!$A$2:$S$100,Lookup!T$3,FALSE)),\"\",VLOOKUP(CONCATENATE($A44,$A$4),Data!$A$2:$S$100,Lookup!T$3,FALSE))","v":268.61686692024801}]
[33,{"$f":"IF(ISNA(VLOOKUP(CONCATENATE($A45,$A$4),Data!$A$2:$S$100,Lookup!C$3,FALSE)),\"\",VLOOKUP(CONCATENATE($A45,$A$4),Data!$A$2:$S$100,Lookup!C$3,FALSE))","v":"Caithness General"},{"$f":"IF(ISNA(VLOOKUP(CONCATENATE($A45,$A$4),Data!$A$2:$S$100,Lookup!D$3,FALSE)),\"\",VLOOKUP(CONCATENATE($A45,$A$4),Data!$A$2:$S$100,Lookup!D$3,FALSE))","v":"H"},{"$f":"IF(ISNA(VLOOKUP(CONCATENATE($A45,$A$4),Data!$A$2:$S$100,Lookup!E$3,FALSE)),\"\",VLOOKUP(CONCATENATE($A45,$A$4),Data!$A$2:$S$100,Lookup!E$3,FALSE))","v":"A3"},{"$f":"IF(ISNA(VLOOKUP(CONCATENATE($A45,$A$4),Data!$A$2:$S$100,Lookup!F$3,FALSE)),\"\",VLOOKUP(CONCATENATE($A45,$A$4),Data!$A$2:$S$100,Lookup!F$3,FALSE))","v":2},{"$f":"IF(ISNA(VLOOKUP(CONCATENATE($A45,$A$4),Data!$A$2:$S$100,Lookup!G$3,FALSE)),\"\",VLOOKUP(CONCATENATE($A45,$A$4),Data!$A$2:$S$100,Lookup!G$3,FALSE))","v":14.268846153846154},{"$f":"IF(ISNA(VLOOKUP(CONCATENATE($A45,$A$4),Data!$A$2:$S$100,Lookup!H$3,FALSE)),\"\",VLOOKUP(CONCATENATE($A45,$A$4),Data!$A$2:$S$100,Lookup!H$3,FALSE))","v":7.1344230769230768},{"$f":"IF(ISNA(VLOOKUP(CONCATENATE($A45,$A$4),Data!$A$2:$S$100,Lookup!I$3,FALSE)),\"\",VLOOKUP(CONCATENATE($A45,$A$4),Data!$A$2:$S$100,Lookup!I$3,FALSE))","v":27.724150229957672},{"$f":"IF(ISNA(VLOOKUP(CONCATENATE($A45,$A$4),Data!$A$2:$S$100,Lookup!J$3,FALSE)),\"\",VLOOKUP(CONCATENATE($A45,$A$4),Data!$A$2:$S$100,Lookup!J$3,FALSE))","v":382.87515000000002},{"$f":"IF(ISNA(VLOOKUP(CONCATENATE($A45,$A$4),Data!$A$2:$S$100,Lookup!K$3,FALSE)),\"\",VLOOKUP(CONCATENATE($A45,$A$4),Data!$A$2:$S$100,Lookup!K$3,FALSE))","v":433.28954999999996},{"$f":"IF(ISNA(VLOOKUP(CONCATENATE($A45,$A$4),Data!$A$2:$S$100,Lookup!L$3,FALSE)),\"\",VLOOKUP(CONCATENATE($A45,$A$4),Data!$A$2:$S$100,Lookup!L$3,FALSE))","v":"-"},{"$f":"IF(ISNA(VLOOKUP(CONCATENATE($A45,$A$4),Data!$A$2:$S$100,Lookup!M$3,FALSE)),\"\",VLOOKUP(CONCATENATE($A45,$A$4),Data!$A$2:$S$100,Lookup!M$3,FALSE))","v":40.650059999999996},{"$f":"IF(ISNA(VLOOKUP(CONCATENATE($A45,$A$4),Data!$A$2:$S$100,Lookup!N$3,FALSE)),\"\",VLOOKUP(CONCATENATE($A45,$A$4),Data!$A$2:$S$100,Lookup!N$3,FALSE))","v":0.84687000000000001},{"$f":"IF(ISNA(VLOOKUP(CONCATENATE($A45,$A$4),Data!$A$2:$S$100,Lookup!O$3,FALSE)),\"\",VLOOKUP(CONCATENATE($A45,$A$4),Data!$A$2:$S$100,Lookup!O$3,FALSE))","v":203.50848999999999},{"$f":"IF(ISNA(VLOOKUP(CONCATENATE($A45,$A$4),Data!$A$2:$S$100,Lookup!P$3,FALSE)),\"\",VLOOKUP(CONCATENATE($A45,$A$4),Data!$A$2:$S$100,Lookup!P$3,FALSE))","v":379.89562000000001},{"$f":"IF(ISNA(VLOOKUP(CONCATENATE($A45,$A$4),Data!$A$2:$S$100,Lookup!Q$3,FALSE)),\"\",VLOOKUP(CONCATENATE($A45,$A$4),Data!$A$2:$S$100,Lookup!Q$3,FALSE))","v":1441.06574},{"$f":"IF(ISNA(VLOOKUP(CONCATENATE($A45,$A$4),Data!$A$2:$S$100,Lookup!R$3,FALSE)),\"\",VLOOKUP(CONCATENATE($A45,$A$4),Data!$A$2:$S$100,Lookup!R$3,FALSE))","v":"-"},{"$f":"IF(ISNA(VLOOKUP(CONCATENATE($A45,$A$4),Data!$A$2:$S$100,Lookup!S$3,FALSE)),\"\",VLOOKUP(CONCATENATE($A45,$A$4),Data!$A$2:$S$100,Lookup!S$3,FALSE))","v":1942.1894660233429},{"$f":"IF(ISNA(VLOOKUP(CONCATENATE($A45,$A$4),Data!$A$2:$S$100,Lookup!T$3,FALSE)),\"\",VLOOKUP(CONCATENATE($A45,$A$4),Data!$A$2:$S$100,Lookup!T$3,FALSE))","v":150.80522402101937}]
[34,{"$f":"IF(ISNA(VLOOKUP(CONCATENATE($A46,$A$4),Data!$A$2:$S$100,Lookup!C$3,FALSE)),\"\",VLOOKUP(CONCATENATE($A46,$A$4),Data!$A$2:$S$100,Lookup!C$3,FALSE))","v":"Belford"},{"$f":"IF(ISNA(VLOOKUP(CONCATENATE($A46,$A$4),Data!$A$2:$S$100,Lookup!D$3,FALSE)),\"\",VLOOKUP(CONCATENATE($A46,$A$4),Data!$A$2:$S$100,Lookup!D$3,FALSE))","v":"H"},{"$f":"IF(ISNA(VLOOKUP(CONCATENATE($A46,$A$4),Data!$A$2:$S$100,Lookup!E$3,FALSE)),\"\",VLOOKUP(CONCATENATE($A46,$A$4),Data!$A$2:$S$100,Lookup!E$3,FALSE))","v":"A3"},{"$f":"IF(ISNA(VLOOKUP(CONCATENATE($A46,$A$4),Data!$A$2:$S$100,Lookup!F$3,FALSE)),\"\",VLOOKUP(CONCATENATE($A46,$A$4),Data!$A$2:$S$100,Lookup!F$3,FALSE))","v":1},{"$f":"IF(ISNA(VLOOKUP(CONCATENATE($A46,$A$4),Data!$A$2:$S$100,Lookup!G$3,FALSE)),\"\",VLOOKUP(CONCATENATE($A46,$A$4),Data!$A$2:$S$100,Lookup!G$3,FALSE))","v":12.484038461538461},{"$f":"IF(ISNA(VLOOKUP(CONCATENATE($A46,$A$4),Data!$A$2:$S$100,Lookup!H$3,FALSE)),\"\",VLOOKUP(CONCATENATE($A46,$A$4),Data!$A$2:$S$100,Lookup!H$3,FALSE))","v":12.484038461538461},{"$f":"IF(ISNA(VLOOKUP(CONCATENATE($A46,$A$4),Data!$A$2:$S$100,Lookup!I$3,FALSE)),\"\",VLOOKUP(CONCATENATE($A46,$A$4),Data!$A$2:$S$100,Lookup!I$3,FALSE))","v":48.512592266049282},{"$f":"IF(ISNA(VLOOKUP(CONCATENATE($A46,$A$4),Data!$A$2:$S$100,Lookup!J$3,FALSE)),\"\",VLOOKUP(CONCATENATE($A46,$A$4),Data!$A$2:$S$100,Lookup!J$3,FALSE))","v":540.88851999999997},{"$f":"IF(ISNA(VLOOKUP(CONCATENATE($A46,$A$4),Data!$A$2:$S$100,Lookup!K$3,FALSE)),\"\",VLOOKUP(CONCATENATE($A46,$A$4),Data!$A$2:$S$100,Lookup!K$3,FALSE))","v":393.59438},{"$f":"IF(ISNA(VLOOKUP(CONCATENATE($A46,$A$4),Data!$A$2:$S$100,Lookup!L$3,FALSE)),\"\",VLOOKUP(CONCATENATE($A46,$A$4),Data!$A$2:$S$100,Lookup!L$3,FALSE))","v":131.90049999999999},{"$f":"IF(ISNA(VLOOKUP(CONCATENATE($A46,$A$4),Data!$A$2:$S$100,Lookup!M$3,FALSE)),\"\",VLOOKUP(CONCATENATE($A46,$A$4),Data!$A$2:$S$100,Lookup!M$3,FALSE))","v":33.05395},{"$f":"IF(ISNA(VLOOKUP(CONCATENATE($A46,$A$4),Data!$A$2:$S$100,Lookup!N$3,FALSE)),\"\",VLOOKUP(CONCATENATE($A46,$A$4),Data!$A$2:$S$100,Lookup!N$3,FALSE))","v":0.34551999999999999},{"$f":"IF(ISNA(VLOOKUP(CONCATENATE($A46,$A$4),Data!$A$2:$S$100,Lookup!O$3,FALSE)),\"\",VLOOKUP(CONCATENATE($A46,$A$4),Data!$A$2:$S$100,Lookup!O$3,FALSE))","v":196.43010999999998},{"$f":"IF(ISNA(VLOOKUP(CONCATENATE($A46,$A$4),Data!$A$2:$S$100,Lookup!P$3,FALSE)),\"\",VLOOKUP(CONCATENATE($A46,$A$4),Data!$A$2:$S$100,Lookup!P$3,FALSE))","v":420.233},{"$f":"IF(ISNA(VLOOKUP(CONCATENATE($A46,$A$4),Data!$A$2:$S$100,Lookup!Q$3,FALSE)),\"\",VLOOKUP(CONCATENATE($A46,$A$4),Data!$A$2:$S$100,Lookup!Q$3,FALSE))","v":1716.44598},{"$f":"IF(ISNA(VLOOKUP(CONCATENATE($A46,$A$4),Data!$A$2:$S$100,Lookup!R$3,FALSE)),\"\",VLOOKUP(CONCATENATE($A46,$A$4),Data!$A$2:$S$100,Lookup!R$3,FALSE))","v":"-"},{"$f":"IF(ISNA(VLOOKUP(CONCATENATE($A46,$A$4),Data!$A$2:$S$100,Lookup!S$3,FALSE)),\"\",VLOOKUP(CONCATENATE($A46,$A$4),Data!$A$2:$S$100,Lookup!S$3,FALSE))","v":2644.0623873561626},{"$f":"IF(ISNA(VLOOKUP(CONCATENATE($A46,$A$4),Data!$A$2:$S$100,Lookup!T$3,FALSE)),\"\",VLOOKUP(CONCATENATE($A46,$A$4),Data!$A$2:$S$100,Lookup!T$3,FALSE))","v":205.30356467601445}]
[35,{"$f":"IF(ISNA(VLOOKUP(CONCATENATE($A47,$A$4),Data!$A$2:$S$100,Lookup!C$3,FALSE)),\"\",VLOOKUP(CONCATENATE($A47,$A$4),Data!$A$2:$S$100,Lookup!C$3,FALSE))","v":"Royal Hospital For Children, Glasgow"},{"$f":"IF(ISNA(VLOOKUP(CONCATENATE($A47,$A$4),Data!$A$2:$S$100,Lookup!D$3,FALSE)),\"\",VLOOKUP(CONCATENATE($A47,$A$4),Data!$A$2:$S$100,Lookup!D$3,FALSE))","v":"G"},{"$f":"IF(ISNA(VLOOKUP(CONCATENATE($A47,$A$4),Data!$A$2:$S$100,Lookup!E$3,FALSE)),\"\",VLOOKUP(CONCATENATE($A47,$A$4),Data!$A$2:$S$100,Lookup!E$3,FALSE))","v":"A4"},{"$f":"IF(ISNA(VLOOKUP(CONCATENATE($A47,$A$4),Data!$A$2:$S$100,Lookup!F$3,FALSE)),\"\",VLOOKUP(CONCATENATE($A47,$A$4),Data!$A$2:$S$100,Lookup!F$3,FALSE))","v":9},{"$f":"IF(ISNA(VLOOKUP(CONCATENATE($A47,$A$4),Data!$A$2:$S$100,Lookup!G$3,FALSE)),\"\",VLOOKUP(CONCATENATE($A47,$A$4),Data!$A$2:$S$100,Lookup!G$3,FALSE))","v":267.34615384615387},{"$f":"IF(ISNA(VLOOKUP(CONCATENATE($A47,$A$4),Data!$A$2:$S$100,Lookup!H$3,FALSE)),\"\",VLOOKUP(CONCATENATE($A47,$A$4),Data!$A$2:$S$100,Lookup!H$3,FALSE))","v":29.705128205128208},{"$f":"IF(ISNA(VLOOKUP(CONCATENATE($A47,$A$4),Data!$A$2:$S$100,Lookup!I$3,FALSE)),\"\",VLOOKUP(CONCATENATE($A47,$A$4),Data!$A$2:$S$100,Lookup!I$3,FALSE))","v":115.43322117004399},{"$f":"IF(ISNA(VLOOKUP(CONCATENATE($A47,$A$4),Data!$A$2:$S$100,Lookup!J$3,FALSE)),\"\",VLOOKUP(CONCATENATE($A47,$A$4),Data!$A$2:$S$100,Lookup!J$3,FALSE))","v":3374.4209999999998},{"$f":"IF(ISNA(VLOOKUP(CONCATENATE($A47,$A$4),Data!$A$2:$S$100,Lookup!K$3,FALSE)),\"\",VLOOKUP(CONCATENATE($A47,$A$4),Data!$A$2:$S$100,Lookup!K$3,FALSE))","v":5015.9269999999997},{"$f":"IF(ISNA(VLOOKUP(CONCATENATE($A47,$A$4),Data!$A$2:$S$100,Lookup!L$3,FALSE)),\"\",VLOOKUP(CONCATENATE($A47,$A$4),Data!$A$2:$S$100,Lookup!L$3,FALSE))","v":602.22400000000005},{"$f":"IF(ISNA(VLOOKUP(CONCATENATE($A47,$A$4),Data!$A$2:$S$100,Lookup!M$3,FALSE)),\"\",VLOOKUP(CONCATENATE($A47,$A$4),Data!$A$2:$S$100,Lookup!M$3,FALSE))","v":520.12400000000002},{"$f":"IF(ISNA(VLOOKUP(CONCATENATE($A47,$A$4),Data!$A$2:$S$100,Lookup!N$3,FALSE)),\"\",VLOOKUP(CONCATENATE($A47,$A$4),Data!$A$2:$S$100,Lookup!N$3,FALSE))","v":2.4169999999999998},{"$f":"IF(ISNA(VLOOKUP(CONCATENATE($A47,$A$4),Data!$A$2:$S$100,Lookup!O$3,FALSE)),\"\",VLOOKUP(CONCATENATE($A47,$A$4),Data!$A$2:$S$100,Lookup!O$3,FALSE))","v":3246.9549999999999},{"$f":"IF(ISNA(VLOOKUP(CONCATENATE($A47,$A$4),Data!$A$2:$S$100,Lookup!P$3,FALSE)),\"\",VLOOKUP(CONCATENATE($A47,$A$4),Data!$A$2:$S$100,Lookup!P$3,FALSE))","v":3697.1320000000001},{"$f":"IF(ISNA(VLOOKUP(CONCATENATE($A47,$A$4),Data!$A$2:$S$100,Lookup!Q$3,FALSE)),\"\",VLOOKUP(CONCATENATE($A47,$A$4),Data!$A$2:$S$100,Lookup!Q$3,FALSE))","v":16459.2},{"$f":"IF(ISNA(VLOOKUP(CONCATENATE($A47,$A$4),Data!$A$2:$S$100,Lookup!R$3,FALSE)),\"\",VLOOKUP(CONCATENATE($A47,$A$4),Data!$A$2:$S$100,Lookup!R$3,FALSE))","v":1225.309},{"$f":"IF(ISNA(VLOOKUP(CONCATENATE($A47,$A$4),Data!$A$2:$S$100,Lookup!S$3,FALSE)),\"\",VLOOKUP(CONCATENATE($A47,$A$4),Data!$A$2:$S$100,Lookup!S$3,FALSE))","v":1183.9447561501941},{"$f":"IF(ISNA(VLOOKUP(CONCATENATE($A47,$A$4),Data!$A$2:$S$100,Lookup!T$3,FALSE)),\"\",VLOOKUP(CONCATENATE($A47,$A$4),Data!$A$2:$S$100,Lookup!T$3,FALSE))","v":91.92978198224624}]

{"sheet":"Data","index":1,"n_rows":56,"n_cols":19,"rows_kept":56,"cut":false,"hidden":false,"merged":[]}
["lookup","org_loc","region","HospGroup","nothea","theahou1","theahou2","Thgrpind","medden","nursing","othstaff","drugs","cssd","othsupp","allocate","totexp","income","costthu","cogrpind"]
["1General hospitals (mainly acute)","Number of Hospitals: 35",null,null,"-","-","-","-","-","-","-","-","-","-","-","-","-","-","-"]
["2General hospitals (mainly acute)","Totals or Averages",null,null,340.59999999999997,8764.8655769230754,25.733604160079494,100,134255.93963000001,159650.07265999998,17688.520419999997,15431.274279999994,17017.006959999995,132790.64257,110147.22976999999,586980.6862900001,8688.5061800000003,1287.8794343043705,100]
["3General hospitals (mainly acute)","Queen Elizabeth University Hospital","G","A1",29,883.15384615384619,30.453580901856764,118.34168549580536,11976.235000000001,17424.784,424.57499999999999,1688.0740000000001,0.161,16686.925999999999,8632.8029999999999,56833.557999999997,3605.1750000000002,1237.5567894782685,96.092596598276842]
["4General hospitals (mainly acute)","Glasgow Royal Infirmary","G","A1",23,623.67307692307691,27.116220735785951,105.3728057955104,7317.2879999999996,12510.713,-0.191,884.08699999999999,6.8819999999999997,8481.1280000000006,6674.835,35874.741999999998,2789.31,1106.1867349141253,85.892103363822727]
["5General hospitals (mainly acute)","Edinburgh Royal Infirmary","S","A1",27,784.96153846153845,29.072649572649571,112.97542851673275,11055.291999999999,11715.736000000001,3737.7339999999999,1492.2909999999999,2445.0390000000002,18926.703000000001,1419.5920000000001,50792.387000000002,"-",1244.3624626390317,96.62103683728408]
["6General hospitals (mainly acute)","Ninewells","T","A1",18,613.24692307692305,34.069273504273504,132.3921565449628,10252.469499999999,10952.9897,1287.46795,927.56191999999999,2071.6816800000001,7374.4057899999998,15595.303,48461.879540000002,"-",1519.712838096337,118.00117290615701]
["7General hospitals (mainly acute)","Aberdeen Royal Infirmary","N","A1",25,494.48076923076923,19.779230769230768,76.861486817747277,10862.116,12012.795,995.58500000000004,1250.76,286.79000000000002,11334.467000000001,7348.5029999999997,44091.016000000003,"-",1714.7363590401742,133.14416810812452]
["8General hospitals (mainly acute)","Western General, Edinburgh","S","A1",11,325.03846153846155,29.54895104895105,114.82632150995119,5655.6019999999999,5994.5050000000001,1205.557,631.31899999999996,698.53800000000001,6602.2070000000003,683.57799999999997,21471.306,"-",1270.3411430599929,98.638203951610521]
["9General hospitals (mainly acute)","West Hospitals","G","A1",11,165.96153846153845,15.087412587412587,58.629224626131723,2359.2869999999998,4103.415,10.031000000000001,459.084,0.28599999999999998,2517.9209999999998,3450.623,12900.647000000001,917.05600000000004,1494.8606025492468,116.07147087931209]
["10General hospitals (mainly acute)","Forth Valley Royal Hospital","V","A2",14.81,364.70692307692303,24.62572066690905,95.694798574351665,5659.80242,4105.0776000000005,710.07154000000003,317.72953999999999,3956.4937799999998,220.85895000000002,5147.5367000000006,20117.570530000001,"-",1060.7869822766015,82.366947869586127]
["11General hospitals (mainly acute)","Royal Alexandra Hospital","G","A2",12,296.21153846153845,24.684294871794872,95.922416145996309,5591.3119999999999,7239.3819999999996,25.762,622.495,192.77799999999999,4550.5119999999997,3636.5050000000001,21858.745999999999,"-",1419.1226384470558,110.19064367726116]
["12General hospitals (mainly acute)","Victoria Kirkcaldy","F","A2",12,445.36538461538464,37.113782051282051,144.22302379569749,4806.259,4635.3829999999998,995.61900000000003,345.59199999999998,95.873000000000005,6002.3419999999996,740.30899999999997,17621.377,"-",760.88678267628131,59.080591118163426]
["13General hospitals (mainly acute)","Wishaw General","L","A2",12,304.73076923076923,25.39423076923077,98.681205365802612,5592.7640000000001,6229.8320000000003,266.774,453.76400000000001,139.374,5123.1220000000003,4937.6009999999997,22743.231,"-",1435.2663763725861,111.44415681642006]
["14General hospitals (mainly acute)","Crosshouse Hospital","A","A2",13,471.23076923076923,36.248520710059168,140.86064464413985,5402.116,6930.4380000000001,71.516999999999996,567.66700000000003,1171.2539999999999,4352.2889999999998,4320.3069999999998,22815.588,"-",931.09647404505392,72.296866402558265]
["15General hospitals (mainly acute)","Hairmyres, East Kilbride","L","A2",8,253.17307692307693,31.646634615384617,122.97785579712148,3727.511,4551.5929999999998,183.364,348.19900000000001,368.93599999999998,5040.99,4566.0680000000002,18786.661,"-",1427.0156475503229,110.80351231177978]
["16General hospitals (mainly acute)","Raigmore, Inverness","H","A2",13,315.44499999999999,24.265000000000001,94.293049077215002,4365.7950599999995,5858.10689,322.69355999999999,694.09401000000003,2.6764200000000002,6926.3276699999997,5060.0819000000001,23229.775510000003,80.553179999999998,1416.1785798328858,109.96204629960677]
["17General hospitals (mainly acute)","St. John's at Howden","S","A2",14,279.96153846153845,19.997252747252748,77.708713567120384,6081.8729999999996,6356.0910000000003,1665.9090000000001,553.81700000000001,1533.07,3523.076,639.80200000000002,20353.637999999999,"-",1398.1067454320648,108.55882221515805]
["18General hospitals (mainly acute)","Monklands Hospital","L","A2",9,214.38461538461539,23.820512820512821,92.565785469979176,4266.3320000000003,3601.5729999999999,115.681,285.983,183.43700000000001,2794.672,4153.4970000000003,15401.174999999999,"-",1381.5191065662002,107.27084149087354]
["19General hospitals (mainly acute)","The Ayr Hospital","A","A2",11,306.71153846153845,27.882867132867133,108.35197028530419,3060.797,4530.3149999999996,872.26400000000001,977.476,780.82299999999998,3256.7429999999999,2813.681,16292.099,"-",1021.512257821807,79.317382560236481]
["20General hospitals (mainly acute)","New Dumfries and Galloway Royal Infirmary","Y","A2",9,223.65384615384616,24.850427350427353,96.568001885168457,2783.797,4521.777,272.96600000000001,285.74400000000003,15,2910.0610000000001,6879.6329999999998,17668.977999999999,"-",1519.25864144454,117.96590588971907]
["21General hospitals (mainly acute)","Inverclyde Royal Hospital","G","A2",7,122.32692307692308,17.475274725274726,67.908383981378321,2060.5230000000001,2580.6790000000001,26,223.011,55.835000000000001,1846.979,2268.46,9061.4869999999992,"-",1424.5381229366451,110.61113990892235]
["22General hospitals (mainly acute)","Borders General","B","A2",6,151.11538461538461,25.185897435897434,97.871628393850415,3602.6370000000002,2891.1950000000002,628.13199999999995,220.779,359.80799999999999,1130.278,2760.0430000000001,11592.871999999999,54.802999999999997,1475.2954950369051,114.55229858793146]
["23General hospitals (mainly acute)","Perth Royal Infirmary","T","A2",8,125.22903846153847,15.653629807692308,60.829527454905687,2093.62131,2577.13906,241.61649,253.75411,1764.18586,1120.37916,3370.47,11421.16599,"-",1753.8887960675133,136.18423816316712]
["24General hospitals (mainly acute)","Queen Margaret Hospital","F","A3",8,150.57692307692307,18.822115384615383,73.142165658295568,1023.016,1796.5,212.81800000000001,610.43700000000001,26.818999999999999,1355.7280000000001,285.584,5310.902,"-",678.27611749680727,52.66611915914072]
["25General hospitals (mainly acute)","Dr. Gray's, Elgin","N","A3",5,133.11538461538461,26.623076923076923,103.45646399728675,2153.1909999999998,2358.3960000000002,-5.6710000000000003,178.90799999999999,78.186999999999998,3037.5160000000001,1560.105,9360.6319999999996,"-",1352.3016469228546,105.00219282197645]
["26General hospitals (mainly acute)","Vale of Leven, Alexandria","G","A3",3,30.865384615384617,10.288461538461538,39.980647384100259,589.35599999999999,715.71500000000003,"-",86.174000000000007,21.248999999999999,390.31900000000002,482.02600000000001,2284.8389999999999,"-",1423.5757009345793,110.53641070862376]
["27General hospitals (mainly acute)","Western Isles, Stornoway","W","A3",2,71.557692307692307,35.778846153846153,139.03550366003466,"-",1001.8131500000001,960.66581999999994,17.65606,"-",332.19690000000003,925.22900000000004,3237.5609300000001,"-",870.07818597151311,67.558978177291365]
["28General hospitals (mainly acute)","Stracathro","T","A3",4,100.97711538461539,25.244278846153847,98.098496771452105,1688.1711399999999,1194.40569,84.979860000000002,77.469920000000002,261.01677999999998,961.93140000000005,3942.3249999999998,8210.2997900000009,"-",1563.6253816077901,121.41085104386032]
["29General hospitals (mainly acute)","Lorn & Islands District G.H.","H","A3",1,10.640384615384615,10.640384615384615,41.34820971518257,565.91922,597.35752000000002,25.8718,89.605720000000005,7.9659999999999995E-2,127.31266000000001,386.91165000000001,1793.0582300000001,"-",3240.6619013193567,251.62773897928989]
["30General hospitals (mainly acute)","Balfour, Kirkwall","R","A3",1.79,40.213461538461537,22.465620971207564,87.300717114699594,928.63031000000001,599.07611999999995,0.3029,0.75499000000000005,143.82139000000001,119.85944000000001,591.50689999999997,2383.9520499999999,"-",1140.0468891970734,88.5212434355591]
["31General hospitals (mainly acute)","Gilbert Bain, Lerwick","Z","A3",2,19.71153846153846,9.8557692307692299,38.299218288507255,724.80899999999997,121.13,850.01199999999994,18.073,0.51200000000000001,245.744,1193.3679999999999,3153.6480000000001,16.3,3076.7297560975608,238.89889644517945]
["32General hospitals (mainly acute)","Galloway Community Hospital","Y","A3",1,9.7115384615384617,9.7115384615384617,37.73874192330959,728.79700000000003,537.28399999999999,"-",17.138999999999999,3.8380000000000001,98.078999999999994,361.89100000000002,1747.028,"-",3459.4613861386138,268.61686692024801]
["33General hospitals (mainly acute)","Caithness General","H","A3",2,14.268846153846154,7.1344230769230768,27.724150229957672,382.87515000000002,433.28954999999996,"-",40.650059999999996,0.84687000000000001,203.50848999999999,379.89562000000001,1441.06574,"-",1942.1894660233429,150.80522402101937]
["34General hospitals (mainly acute)","Belford","H","A3",1,12.484038461538461,12.484038461538461,48.512592266049282,540.88851999999997,393.59438,131.90049999999999,33.05395,0.34551999999999999,196.43010999999998,420.233,1716.44598,"-",2644.0623873561626,205.30356467601445]
["35General hospitals (mainly acute)","Royal Hospital For Children, Glasgow","G","A4",9,267.34615384615387,29.705128205128208,115.43322117004399,3374.4209999999998,5015.9269999999997,602.22400000000005,520.12400000000002,2.4169999999999998,3246.9549999999999,3697.1320000000001,16459.2,1225.309,1183.9447561501941,91.92978198224624]
["36General hospitals (mainly acute)","RHSC, Edinburgh","S","A4",5,83.288461538461533,16.657692307692308,64.731283671229249,2347.1790000000001,2068.0630000000001,401.62900000000002,178.202,341.46899999999999,1390.547,233.136,6960.2250000000004,"-",1607.0711152158856,124.78428278373137]
["37General hospitals (mainly acute)","Royal Aberdeen Children's","N","A4",3,55.346153846153847,18.448717948717949,71.69115462395051,635.25699999999995,1494.002,364.65899999999999,79.745000000000005,7.484,362.12799999999999,588.65499999999997,3531.93,"-",1227.2168172341903,95.289728568191151]
["1Long stay hospitals","Number of Hospitals:  2",null,null,"-","-","-","-","-","-","-","-","-","-","-","-","-","-","-"]
["2Long stay hospitals","Totals or Averages",null,null,6,137.75,22.958333333333332,100,2317.9270000000001,1880.55,111.495,156.34299999999999,118.83799999999999,4399.22,1845.2919999999999,10829.665000000001,"-",1511.8895714086277,100]
["3Long stay hospitals","Woodend General, Aberdeen","N","B8",5,134.05769230769232,26.811538461538465,116.78347061287172,2238.7620000000002,1880.55,111.495,156.34299999999999,118.83799999999999,4399.22,1781.0419999999999,10686.25,"-",1532.9579687275855,101.39351429610883]
["4Long stay hospitals","Roodlands, Haddington","S","B8",1,3.6923076923076925,3.6923076923076925,16.082646935641492,79.165000000000006,"-","-","-","-","-",64.25,143.41499999999999,"-",746.953125,49.405270009506296]
["1Maternity hospitals","Number of Hospitals:  1",null,null,"-","-","-","-","-","-","-","-","-","-","-","-","-","-","-"]
["2Maternity hospitals","Totals or Averages",null,null,1,37.846153846153847,37.846153846153847,100,973.52499999999998,1538.9269999999999,116.452,130.71,73.227000000000004,421.37,650.84199999999998,3905.0529999999999,"-",1984.2748983739837,100]
["3Maternity hospitals","Aberdeen Maternity","N","E19",1,37.846153846153847,37.846153846153847,100,973.52499999999998,1538.9269999999999,116.452,130.71,73.227000000000004,421.37,650.84199999999998,3905.0529999999999,"-",1984.2748983739837,100]
["1Other - miscellaneous hospitals","Number of Hospitals:  4",null,null,"-","-","-","-","-","-","-","-","-","-","-","-","-","-","-"]
["2Other - miscellaneous hospitals","Totals or Averages",null,null,30,758.15384615384619,25.271794871794874,100,8913.2879999999986,13276.411,2366.663,1852.4560000000001,10.026,16651.460999999999,13658.545999999998,56728.851000000002,970.92000000000007,1438.9420403814936,100]
["3Other - miscellaneous hospitals","Golden Jubilee National Hospital","D","G21",15,509.46153846153845,33.964102564102561,134.39529220779218,6374.1189999999997,7455.64,2333.9650000000001,1182.2470000000001,1.4810000000000001,13326.168,7303.9719999999998,37977.591999999997,"-",1433.5494488902309,99.625239145154652]
["4Other - miscellaneous hospitals","New Victoria Hospital","G","G21",8,125.82692307692308,15.728365384615385,62.236835430194802,1499.711,2846.72,32.698,396.01400000000001,0.51100000000000001,1581.867,3176.1680000000001,9533.6890000000003,600.50900000000001,1457.0822252789239,101.26066126281368]
["5Other - miscellaneous hospitals","New Stobhill Hospital","G","G21",6,107.11538461538461,17.852564102564102,70.642248376623371,1039.4580000000001,2974.0509999999999,"-",198.327,0.47299999999999998,1410.826,3015.6329999999998,8638.768,370.411,1550.9457809694793,107.78375622122287]
["6Other - miscellaneous hospitals","Mountainhall Treatment Centre","Y","G21",1,15.75,15.75,62.32244318181818,"-","-","-",75.867999999999995,7.5609999999999999,332.6,162.773,578.80200000000002,"-",706.71794871794873,49.113718891039078]
["1Community hospitals","Number of Hospitals:  3",null,null,"-","-","-","-","-","-","-","-","-","-","-","-","-","-","-"]
["2Community hospitals","Totals or Averages",null,null,3,35.305576923076927,11.768525641025642,100,0.89480999999999999,182.02141,13.19974,81.284440000000004,248.93514999999999,4.8089700000000004,162.60566,693.75018,"-",377.88221516539659,100]
["3Community hospitals","Falkirk Community Hospital","V","J26",1,19.92096153846154,19.92096153846154,169.27321353675876,0.89480999999999999,145.35498000000001,13.19974,81.284440000000004,248.93514999999999,4.8089700000000004,137.37666000000002,631.85474999999997,"-",609.96317176534183,161.4162157640483]
["4Community hospitals","Uist & Barra Hospital","W","J26",1,14.423076923076923,14.423076923076923,122.55636230928869,"-",31.343630000000001,"-","-","-","-",25.228999999999999,56.572629999999997,"-",75.430173333333329,19.961292250898346]
["5Community hospitals","St. Brendan's, Barra","W","J26",1,0.96153846153846156,0.96153846153846156,8.1704241539525775,"-",5.3228,"-","-","-","-","-",5.3228,"-",106.456,28.171741280124792]

{"sheet":"Lookup","index":2,"n_rows":7,"n_cols":38,"rows_kept":7,"cut":false,"hidden":false,"merged":[]}
[]
[]
["General hospitals (mainly acute)",null,2,3,4,5,6,7,8,9,10,11,12,13,14,15,16,17,18,19,20,21,22,23,24,25,26,27,28,29,30,31,32,33,34,35,36,37]
["Community hospitals"]
["Long stay hospitals"]
["Maternity hospitals"]
["Other - miscellaneous hospitals"]