{"text_format":"1","workbook":"xlsx","n_sheets":7,"sheets":["Contents","Table 1","Fig 1","data2","Fig 2","Lookups","Data DCE"],"not_rendered":{"charts":2,"images":3,"macros":1,"external_links":0,"defined_names":3,"comments":0,"pivot_tables":0},"unopened":[],"bounds":{"document_bytes":16777216,"sheet_cells":100000,"rows_first":2000,"rows_last":500,"rows_between":2000,"halvings":0,"cell_chars":16384,"cell_head_chars":4096},"cells_cut":0,"cells_raw":0,"read":"whole","date_system":"1900"}

{"sheet":"Contents","index":0,"n_rows":42,"n_cols":3,"rows_kept":42,"cut":false,"hidden":false,"merged":[[4,0,6,13],[10,2,10,4],[32,0,35,15],[27,0,30,15],[39,0,40,15],[22,0,22,3],[19,0,19,1],[16,0,16,4]]}
["Detect Cancer Early - Staging Data by Deprivation"]
[]
["In order to view the tables to full effect, the macros will need to be enabled. To do this, select options – enable this content."]
[]
["The following tables and figures present the Detect Cancer Early staging data by deprivation category for Baseline (2010 & 2011) to Year 8 (2018 & 2019). The residence of the patient on the date of diagnosis is assigned a deprivation category 1 to 5 (1 being the most deprived, 5 the least deprived) based on the Scottish Index of Mutiple Deprivation (SIMD)."]
[]
[]
[]
[null,"Time period: ","01 January 2010 - 31 December 2019."]
[null,"Source: ","PHS Detect Cancer Early data collected from local National Prospective Cancer Audit data sets"]
[null,"Extract date: ","2020-10-10"]
[]
["Use the hyperlinks in the lists below to nativigate to the required table or figure;"]
[]
["List of Tables and Figures"]
[]
["Table 1 - Breast, colorectal and lung cancer (combined)"]
["Table 1: Number and percentage of patients in Scotland diagnosed with breast, colorectal and lung cancer by stage and deprivation category for 2010-2011 to 2018-2019 combined."]
[]
["Figure 1 - Deprivation"]
["Figure 1: Proportion of patients in Scotland diagnosed with breast cancer by stage and deprivation category for 2010-2011 to 2018-2019 combined."]
[]
["Figure 2 - Trend in percentage change of stage 1"]
["Figure 2: Trend in stage 1 percentage change from baseline for each stage for breast, colorectal and lung cancer in Scotland by deprivation category."]
[]
["Notes"]
[]
["1) Cancer staging is the process of determining the extent to which a cancer has developed and spread. For the majority of patients with cancer it is common practice to assign a number from 1 to 4 to a cancer, with 1 indicating the cancer is confined to the original organ in which it occurred and 4 being a cancer which has spread beyond the original organ and local lymph glands (regional lymph nodes). Patients diagnosed with stage 1 disease tend to have better outcomes and longer survival compared to patients diagnosed with stage 4 disease."]
[]
[]
[]
[]
["2) The following ICD-10 (International Classification of Diseases, 10th Revision) codes have been used:\n    Breast: ICD-10 C50\n    Colorectal: ICD-10 C18-C20\n    Lung: ICD-10 C33-C34"]
[]
[]
[]
[]
["3) Deprivation categories are the Scottish Index of Mutiple Deprivation (SIMD) 2012 quintiles. Refer to www.gov.scot/Topics/Statistics/SIMD for more information."]
[]
["4) The total figures presented here may differ slightly to those in the main DCE Staging Tables (see link below). There are a small number of patients where the deprivation category is not available in the DCE datamart due to technical issues."]
{"$rows_left_out":3}
{"sheet":"Table 1","index":1,"n_rows":25,"n_cols":20,"rows_kept":25,"cut":false,"hidden":false,"merged":[[8,17,8,18],[8,0,9,0],[8,2,8,3],[8,5,8,6],[8,8,8,9],[8,11,8,12],[8,14,8,15]]}
["Detect Cancer Early - Trend Staging Data"]
[{"$f":"\"Table 1: Number and percentage of patients in Scotland diagnosed with \"&(VLOOKUP($T$2,Lookups!$A$28:$B$31,2,0))&\" - by stage and deprivation category for \"&(VLOOKUP($T$3,Lookups!$A$1:$B$9,2,0))&\" combined\"","v":"Table 1: Number and percentage of patients in Scotland diagnosed with Breast, Colorectal & Lung combined - by stage and deprivation category for Year 8 (2018 & 2019) combined"},null,null,null,null,null,null,null,null,null,null,null,null,null,null,null,null,null,null,4]
[null,null,null,null,null,null,null,null,null,null,null,null,null,null,null,null,null,null,null,9]
["Please select which combined years you require:",null,null,null,null,null,null,null,null,null,null,null,null,null,null,null,null,null,null,{"$f":"CONCATENATE(T2,T3)","v":"49"}]
[]
["Please select which cancer type you require : "]
[]
[]
["Deprivation Category",null,"Stage 1",null,null,"Stage 2",null,null,"Stage 3",null,null,"Stage 4",null,null,"Stage Not Known",null,null,"Total"]
[null,null,"Number","%",null,"Number","%",null,"Number","%",null,"Number","%",null,"Number","%",null,"Number","%"]
[]
["All categories",null,{"$f":"VLOOKUP(\"6\"&$T$4,'Data DCE'!$A$1:$M$217,2,FALSE)","v":6480},{"$f":"VLOOKUP(\"6\"&$T$4,'Data DCE'!$A$1:$M$217,3,FALSE)","v":25.620749644156302},null,{"$f":"VLOOKUP(\"6\"&$T$4,'Data DCE'!$A$1:$M$217,4,FALSE)","v":6435},{"$f":"VLOOKUP(\"6\"&$T$4,'Data DCE'!$A$1:$M$217,5,FALSE)","v":25.4428277716274},null,{"$f":"VLOOKUP(\"6\"&$T$4,'Data DCE'!$A$1:$M$217,6,FALSE)","v":4358},{"$f":"VLOOKUP(\"6\"&$T$4,'Data DCE'!$A$1:$M$217,7,FALSE)","v":17.230744899573001},null,{"$f":"VLOOKUP(\"6\"&$T$4,'Data DCE'!$A$1:$M$217,8,FALSE)","v":6415},{"$f":"VLOOKUP(\"6\"&$T$4,'Data DCE'!$A$1:$M$217,9,FALSE)","v":25.363751383836799},null,{"$f":"VLOOKUP(\"6\"&$T$4,'Data DCE'!$A$1:$M$217,10,FALSE)","v":1604},{"$f":"VLOOKUP(\"6\"&$T$4,'Data DCE'!$A$1:$M$217,11,FALSE)","v":6.3419263008065796},null,{"$f":"VLOOKUP(\"6\"&$T$4,'Data DCE'!$A$1:$M$217,12,FALSE)","v":25292},{"$f":"VLOOKUP(\"6\"&$T$4,'Data DCE'!$A$1:$M$217,13,FALSE)","v":100}]
[]
["1=most deprived",null,{"$f":"VLOOKUP(\"1\"&$T$4,'Data DCE'!$A$1:$M$217,2,FALSE)","v":1347},{"$f":"VLOOKUP(\"1\"&$T$4,'Data DCE'!$A$1:$M$217,3,FALSE)","v":23.7901801483575},null,{"$f":"VLOOKUP(\"1\"&$T$4,'Data DCE'!$A$1:$M$217,4,FALSE)","v":1285},{"$f":"VLOOKUP(\"1\"&$T$4,'Data DCE'!$A$1:$M$217,5,FALSE)","v":22.6951607205934},null,{"$f":"VLOOKUP(\"1\"&$T$4,'Data DCE'!$A$1:$M$217,6,FALSE)","v":1093},{"$f":"VLOOKUP(\"1\"&$T$4,'Data DCE'!$A$1:$M$217,7,FALSE)","v":19.304132815259599},null,{"$f":"VLOOKUP(\"1\"&$T$4,'Data DCE'!$A$1:$M$217,8,FALSE)","v":1605},{"$f":"VLOOKUP(\"1\"&$T$4,'Data DCE'!$A$1:$M$217,9,FALSE)","v":28.346873896149798},null,{"$f":"VLOOKUP(\"1\"&$T$4,'Data DCE'!$A$1:$M$217,10,FALSE)","v":332},{"$f":"VLOOKUP(\"1\"&$T$4,'Data DCE'!$A$1:$M$217,11,FALSE)","v":5.8636524196397},null,{"$f":"VLOOKUP(\"1\"&$T$4,'Data DCE'!$A$1:$M$217,12,FALSE)","v":5662},{"$f":"VLOOKUP(\"1\"&$T$4,'Data DCE'!$A$1:$M$217,13,FALSE)","v":100}]
["2",null,{"$f":"VLOOKUP(\"2\"&$T$4,'Data DCE'!$A$1:$M$217,2,FALSE)","v":1297},{"$f":"VLOOKUP(\"2\"&$T$4,'Data DCE'!$A$1:$M$217,3,FALSE)","v":24.197761194029901},null,{"$f":"VLOOKUP(\"2\"&$T$4,'Data DCE'!$A$1:$M$217,4,FALSE)","v":1316},{"$f":"VLOOKUP(\"2\"&$T$4,'Data DCE'!$A$1:$M$217,5,FALSE)","v":24.552238805970099},null,{"$f":"VLOOKUP(\"2\"&$T$4,'Data DCE'!$A$1:$M$217,6,FALSE)","v":903},{"$f":"VLOOKUP(\"2\"&$T$4,'Data DCE'!$A$1:$M$217,7,FALSE)","v":16.847014925373099},null,{"$f":"VLOOKUP(\"2\"&$T$4,'Data DCE'!$A$1:$M$217,8,FALSE)","v":1455},{"$f":"VLOOKUP(\"2\"&$T$4,'Data DCE'!$A$1:$M$217,9,FALSE)","v":27.1455223880597},null,{"$f":"VLOOKUP(\"2\"&$T$4,'Data DCE'!$A$1:$M$217,10,FALSE)","v":389},{"$f":"VLOOKUP(\"2\"&$T$4,'Data DCE'!$A$1:$M$217,11,FALSE)","v":7.2574626865671696},null,{"$f":"VLOOKUP(\"2\"&$T$4,'Data DCE'!$A$1:$M$217,12,FALSE)","v":5360},{"$f":"VLOOKUP(\"2\"&$T$4,'Data DCE'!$A$1:$M$217,13,FALSE)","v":100}]
["3",null,{"$f":"VLOOKUP(\"3\"&$T$4,'Data DCE'!$A$1:$M$217,2,FALSE)","v":1244},{"$f":"VLOOKUP(\"3\"&$T$4,'Data DCE'!$A$1:$M$217,3,FALSE)","v":24.820430965682402},null,{"$f":"VLOOKUP(\"3\"&$T$4,'Data DCE'!$A$1:$M$217,4,FALSE)","v":1276},{"$f":"VLOOKUP(\"3\"&$T$4,'Data DCE'!$A$1:$M$217,5,FALSE)","v":25.458898643256202},null,{"$f":"VLOOKUP(\"3\"&$T$4,'Data DCE'!$A$1:$M$217,6,FALSE)","v":897},{"$f":"VLOOKUP(\"3\"&$T$4,'Data DCE'!$A$1:$M$217,7,FALSE)","v":17.897047086991201},null,{"$f":"VLOOKUP(\"3\"&$T$4,'Data DCE'!$A$1:$M$217,8,FALSE)","v":1269},{"$f":"VLOOKUP(\"3\"&$T$4,'Data DCE'!$A$1:$M$217,9,FALSE)","v":25.3192338387869},null,{"$f":"VLOOKUP(\"3\"&$T$4,'Data DCE'!$A$1:$M$217,10,FALSE)","v":326},{"$f":"VLOOKUP(\"3\"&$T$4,'Data DCE'!$A$1:$M$217,11,FALSE)","v":6.5043894652833201},null,{"$f":"VLOOKUP(\"3\"&$T$4,'Data DCE'!$A$1:$M$217,12,FALSE)","v":5012},{"$f":"VLOOKUP(\"3\"&$T$4,'Data DCE'!$A$1:$M$217,13,FALSE)","v":100}]
["4",null,{"$f":"VLOOKUP(\"4\"&$T$4,'Data DCE'!$A$1:$M$217,2,FALSE)","v":1288},{"$f":"VLOOKUP(\"4\"&$T$4,'Data DCE'!$A$1:$M$217,3,FALSE)","v":27.138643067846601},null,{"$f":"VLOOKUP(\"4\"&$T$4,'Data DCE'!$A$1:$M$217,4,FALSE)","v":1273},{"$f":"VLOOKUP(\"4\"&$T$4,'Data DCE'!$A$1:$M$217,5,FALSE)","v":26.822587442056498},null,{"$f":"VLOOKUP(\"4\"&$T$4,'Data DCE'!$A$1:$M$217,6,FALSE)","v":765},{"$f":"VLOOKUP(\"4\"&$T$4,'Data DCE'!$A$1:$M$217,7,FALSE)","v":16.118836915297098},null,{"$f":"VLOOKUP(\"4\"&$T$4,'Data DCE'!$A$1:$M$217,8,FALSE)","v":1124},{"$f":"VLOOKUP(\"4\"&$T$4,'Data DCE'!$A$1:$M$217,9,FALSE)","v":23.683101559207799},null,{"$f":"VLOOKUP(\"4\"&$T$4,'Data DCE'!$A$1:$M$217,10,FALSE)","v":296},{"$f":"VLOOKUP(\"4\"&$T$4,'Data DCE'!$A$1:$M$217,11,FALSE)","v":6.2368310155920801},null,{"$f":"VLOOKUP(\"4\"&$T$4,'Data DCE'!$A$1:$M$217,12,FALSE)","v":4746},{"$f":"VLOOKUP(\"4\"&$T$4,'Data DCE'!$A$1:$M$217,13,FALSE)","v":100}]
["5=least deprived",null,{"$f":"VLOOKUP(\"5\"&$T$4,'Data DCE'!$A$1:$M$217,2,FALSE)","v":1304},{"$f":"VLOOKUP(\"5\"&$T$4,'Data DCE'!$A$1:$M$217,3,FALSE)","v":28.9007092198582},null,{"$f":"VLOOKUP(\"5\"&$T$4,'Data DCE'!$A$1:$M$217,4,FALSE)","v":1285},{"$f":"VLOOKUP(\"5\"&$T$4,'Data DCE'!$A$1:$M$217,5,FALSE)","v":28.479609929077998},null,{"$f":"VLOOKUP(\"5\"&$T$4,'Data DCE'!$A$1:$M$217,6,FALSE)","v":700},{"$f":"VLOOKUP(\"5\"&$T$4,'Data DCE'!$A$1:$M$217,7,FALSE)","v":15.514184397163101},null,{"$f":"VLOOKUP(\"5\"&$T$4,'Data DCE'!$A$1:$M$217,8,FALSE)","v":962},{"$f":"VLOOKUP(\"5\"&$T$4,'Data DCE'!$A$1:$M$217,9,FALSE)","v":21.320921985815598},null,{"$f":"VLOOKUP(\"5\"&$T$4,'Data DCE'!$A$1:$M$217,10,FALSE)","v":261},{"$f":"VLOOKUP(\"5\"&$T$4,'Data DCE'!$A$1:$M$217,11,FALSE)","v":5.7845744680851103},null,{"$f":"VLOOKUP(\"5\"&$T$4,'Data DCE'!$A$1:$M$217,12,FALSE)","v":4512},{"$f":"VLOOKUP(\"5\"&$T$4,'Data DCE'!$A$1:$M$217,13,FALSE)","v":100}]
[]
["Source: PHS Detect Cancer Early data."]
[]
["Notes:"]
["1. Patients diagnosed from 01 January 2010 - 31 December 2019 as at 20 October 2020."]
["2. There has been an increase in NHS Grampian unknown stage for lung cancer for 2017. This is due to them moving to using the updated staging classification TNM8 a year early. "]
["3. The deprivation category is mapped on by postcode. Cases with missing or invalid postcodes are excluded from this table."]

{"sheet":"Fig 1","index":2,"n_rows":51,"n_cols":18,"rows_kept":51,"cut":false,"hidden":false,"merged":[[48,0,48,18],[51,0,52,15]]}
["Detect Cancer Early - Staging Data by deprivation",null,null,null,null,null,null,null,null,null,null,null,null,null,null,null,null,"back to contents"]
[]
[{"$f":"\"Figure 1: Proportion of patients in Scotland diagnosed with (\"&(VLOOKUP('Table 1'!T2,Lookups!$A$28:$B$31,2,0))&\") - by stage and deprivation category for \"&(VLOOKUP('Table 1'!T3,Lookups!$A$1:$B$9,2,0))&\" combined\"","v":"Figure 1: Proportion of patients in Scotland diagnosed with (Breast, Colorectal & Lung combined) - by stage and deprivation category for Year 8 (2018 & 2019) combined"}]
[]
[]
[]
[]
[]
[]
[]
[]
[]
[]
[]
[]
[]
[]
[]
[]
[]
[]
[]
[]
[]
[]
[]
[]
[]
[]
[]
[]
[]
[]
[]
[]
[]
[]
[]
[]
[]
{"$rows_left_out":12}
{"sheet":"data2","index":3,"n_rows":46,"n_cols":15,"rows_kept":46,"cut":false,"hidden":true,"merged":[]}
["SIMD"]
["1=most deprived","Baseline",20.244077530509699,null,null,null,null,null,"1=most deprived","Baseline",0]
[null,"Year 1",21.088554427721402,null,null,null,null,null,null,"Year 1",{"$f":"(C3-C$2)/C$2","v":4.171476304311706E-2}]
[null,"Year 2",22.019781363873001,null,null,null,null,null,null,"Year 2",{"$f":"(C4-C$2)/C$2","v":8.7714731910463778E-2}]
[null,"Year 3",22.591822591822599,null,null,null,null,null,null,"Year 3",0.1159719457591797]
[null,"Year 4",23.3698487219614,null,null,null,null,null,null,"Year 4",0.15440422942170987]
[null,"Year 5",23.737740646567399,null,null,null,null,null,null,"Year 5",0.17257704683221187]
[null,"Year 6",22.608370702541102,null,null,null,null,null,null,"Year 6",0.11678937548367881]
[null,"Year 7",22.5776455272457,null,null,null,null,null,null,"Year 7",{"$f":"(C9-C$2)/C$2","v":0.11527163898770383}]
[null,"Year 8",23.7901801483575,null,null,null,null,null,null,"Year 8",{"$f":"(C10-C$2)/C$2","v":0.17516740945609874}]
[2,"Baseline",null,21.662563908350698,null,null,null,null,"2","Baseline",null,0]
[null,"Year 1",null,23.244239631336399,null,null,null,null,null,"Year 1",null,{"$f":"(D12-D$11)/D$11","v":7.3014243820694769E-2}]
[null,"Year 2",null,22.594453750232699,null,null,null,null,null,"Year 2",null,4.3018446284780097E-2]
[null,"Year 3",null,22.518159806295401,null,null,null,null,null,"Year 3",null,3.9496520428723543E-2]
[null,"Year 4",null,23.498098859315601,null,null,null,null,null,"Year 4",null,8.473304262277663E-2]
[null,"Year 5",null,23.7304314623902,null,null,null,null,null,"Year 5",null,9.5458116721001809E-2]
[null,"Year 6",null,23.3910425291682,null,null,null,null,null,"Year 6",null,7.9791045424276411E-2]
[null,"Year 7",null,24.117205108940599,null,null,null,null,null,"Year 7",null,{"$f":"(D18-D$11)/D$11","v":0.11331258898876977}]
[null,"Year 8",null,24.197761194029901,null,null,null,null,null,"Year 8",null,{"$f":"(D19-D$11)/D$11","v":0.11703126630832052}]
[3,"Baseline",null,null,24.198375374091501,null,null,null,"3","Baseline",null,null,0]
[null,"Year 1",null,null,24.263938191689299,null,null,null,null,"Year 1",null,null,{"$f":"(E21-E$20)/E$20","v":2.7093892289973141E-3}]
[null,"Year 2",null,null,24.916805324459201,null,null,null,null,"Year 2",null,null,2.9689181164488494E-2]
[null,"Year 3",null,null,25.329218106995899,null,null,null,null,"Year 3",null,null,4.6732175835042154E-2]
[null,"Year 4",null,null,24.6555915721232,null,null,null,null,"Year 4",null,null,1.8894499773783432E-2]
[null,"Year 5",null,null,25.442204853969599,null,null,null,null,"Year 5",null,null,5.1401363134891701E-2]
[null,"Year 6",null,null,25.719649561952401,null,null,null,null,"Year 6",null,null,6.2866790201530812E-2]
[null,"Year 7",null,null,25.286415711947601,null,null,null,null,"Year 7",null,null,{"$f":"(E27-E$20)/E$20","v":4.496336307854093E-2}]
[null,"Year 8",null,null,24.820430965682402,null,null,null,null,"Year 8",null,null,{"$f":"(E28-E$20)/E$20","v":2.5706502274401331E-2}]
[4,"Baseline",null,null,null,25.358524926018699,null,null,"4","Baseline",null,null,null,0]
[null,"Year 1",null,null,null,26.1049423035053,null,null,null,"Year 1",null,null,null,{"$f":"(F30-F$29)/F$29","v":2.9434573961388103E-2}]
[null,"Year 2",null,null,null,26.3755458515284,null,null,null,"Year 2",null,null,null,4.0105681559821471E-2]
[null,"Year 3",null,null,null,27.286486486486499,null,null,null,"Year 3",null,null,null,7.6028143044300125E-2]
[null,"Year 4",null,null,null,26.615886833514701,null,null,null,"Year 4",null,null,null,4.958340089434405E-2]
[null,"Year 5",null,null,null,26.7467734757454,null,null,null,"Year 5",null,null,null,5.474484631013813E-2]
[null,"Year 6",null,null,null,27.236755330841898,null,null,null,"Year 6",null,null,null,7.4067021260218163E-2]
[null,"Year 7",null,null,null,27.148645766687999,null,null,null,"Year 7",null,null,null,7.0592467262659081E-2]
[null,"Year 8",null,null,null,27.138643067846601,null,null,null,"Year 8",null,null,null,7.0198016131507751E-2]
["5=least deprived","Baseline",null,null,null,null,26.664972038637501,null,"5=least deprived","Baseline",null,null,null,null,0]
[null,"Year 1",null,null,null,null,27.445652173913,null,null,"Year 1",null,null,null,null,{"$f":"(G39-G$38)/G$38","v":2.9277365606995398E-2}]
[null,"Year 2",null,null,null,null,28.1663061763999,null,null,"Year 2",null,null,null,null,5.6303608178811068E-2]
{"$rows_left_out":7}
{"sheet":"Fig 2","index":4,"n_rows":52,"n_cols":18,"rows_kept":52,"cut":false,"hidden":false,"merged":[[2,0,3,18],[48,0,48,18],[51,0,52,15]]}
[{"$f":"\"Detect Cancer Early - Stage 1 data by deprivation\"","v":"Detect Cancer Early - Stage 1 data by deprivation"},null,null,null,null,null,null,null,null,null,null,null,null,null,null,null,null,"back to contents"]
[]
[{"$f":"\"Figure 2: Trend in stage 1 percentage change from baseline for each stage for breast, colorectal and lung cancer in Scotland by deprivation category.\"","v":"Figure 2: Trend in stage 1 percentage change from baseline for each stage for breast, colorectal and lung cancer in Scotland by deprivation category."}]
[]
[]
[]
[]
[]
[]
[]
[]
[]
[]
[]
[]
[]
[]
[]
[]
[]
[]
[]
[]
[]
[]
[]
[]
[]
[]
[]
[]
[]
[]
[]
[]
[]
[]
[]
[]
[]
{"$rows_left_out":13}
{"sheet":"Lookups","index":5,"n_rows":37,"n_cols":2,"rows_kept":37,"cut":false,"hidden":true,"merged":[]}
[1,"Baseline (2010 & 2011)"]
[2,"Year 1 (2011 & 2012)"]
[3,"Year 2 (2012 & 2013)"]
[4,"Year 3 (2013 & 2014)"]
[5,"Year 4 (2014 & 2015)"]
[6,"Year 5 (2015 & 2016)"]
[7,"Year 6 (2016 & 2017)"]
[8,"Year 7 (2017 & 2018)"]
[9,"Year 8 (2018 & 2019)"]
[]
[]
[]
[]
[]
[]
[]
[]
[]
[]
[]
[]
[]
[]
[]
[]
[]
[]
[4,"Breast, Colorectal & Lung combined"]
[1,"Breast"]
[2,"Colorectal"]
[3,"Lung"]
[]
[1,"Stage 1"]
[2,"Stage 2"]
[3,"Stage 3"]
[4,"Stage 4"]
[5,"Stage Not Known"]

{"sheet":"Data DCE","index":6,"n_rows":217,"n_cols":13,"rows_kept":217,"cut":false,"hidden":true,"merged":[]}
["Lookup Code","Stage 1","%","Stage 2","%","Stage 3","%","Stage 4","%","Stage Not Known","%","Total","%"]
["111",530,35.475234270415001,675,45.180722891566298,119,7.9651941097724199,112,7.4966532797858099,58,3.8821954484605099,1494,100]
["112",552,37.146702557200499,686,46.164199192463002,104,6.9986541049798099,107,7.20053835800808,37,2.4899057873485901,1486,100]
["113",572,37.2638436482085,701,45.667752442996701,133,8.6644951140065203,97,6.3192182410423499,32,2.0846905537459302,1535,100]
["114",561,37.078651685393297,699,46.199603436880402,142,9.3853271645737006,91,6.0145406477197598,20,1.3218770654329099,1513,100]
["115",585,37.9377431906615,708,45.914396887159498,147,9.5330739299610894,90,5.8365758754863801,12,0.77821011673151796,1542,100]
["116",597,39.019607843137301,681,44.509803921568597,142,9.2810457516339895,95,6.2091503267973902,15,0.98039215686274495,1530,100]
["117",552,38.520586182833199,645,45.010467550593198,137,9.5603628750872307,83,5.7920446615492001,16,1.1165387299371901,1433,100]
["118",526,36.655052264808397,673,46.8989547038328,130,9.0592334494773503,94,6.5505226480836196,12,0.83623693379790898,1435,100]
["119",549,35.5339805825243,728,47.119741100323601,127,8.2200647249190908,108,6.9902912621359201,33,2.13592233009709,1545,100]
["121",230,16.570605187319899,352,25.360230547550401,307,22.1181556195965,230,16.570605187319899,269,19.380403458213301,1388,100]
["122",230,16.197183098591601,370,26.056338028169002,311,21.901408450704199,276,19.436619718309899,233,16.408450704225402,1420,100]
["123",215,16.475095785440601,339,25.977011494252899,294,22.528735632183899,295,22.605363984674302,162,12.413793103448301,1305,100]
["124",206,16.362192216044502,326,25.8935663224782,303,24.066719618745001,313,24.8610007942812,111,8.8165210484511505,1259,100]
["125",181,14.5381526104418,312,25.060240963855399,316,25.381526104417699,320,25.702811244979902,116,9.3172690763052195,1245,100]
["126",163,13.743676222596999,289,24.3676222596965,292,24.6205733558179,310,26.1382799325464,132,11.129848229342301,1186,100]
["127",169,14.0950792326939,279,23.269391159299399,294,24.520433694745599,328,27.356130108423699,129,10.7589658048374,1199,100]
["128",181,14.48,289,23.12,312,24.96,336,26.88,132,10.56,1250,100]
["129",193,14.903474903474899,321,24.787644787644801,325,25.096525096525099,300,23.166023166023201,156,12.046332046331999,1295,100]
["131",368,13.6802973977695,187,6.9516728624535302,658,24.460966542750899,1296,48.178438661709997,181,6.7286245353159897,2690,100]
["132",423,15.064102564102599,215,7.65669515669516,672,23.9316239316239,1344,47.863247863247899,154,5.4843304843304796,2808,100]
["133",482,16.489907629148099,263,8.9976052001368494,679,23.229558672596699,1373,46.972288744440696,126,4.3106397536777301,2923,100]
["134",537,17.899999999999999,266,8.8666666666666707,724,24.133333333333301,1355,45.1666666666667,118,3.93333333333333,3000,100]
["135",578,19.500674763832698,255,8.6032388663967598,705,23.785425101214599,1296,43.724696356275302,130,4.3859649122807003,2964,100]
["136",547,19.605734767025101,246,8.8172043010752699,641,22.974910394265201,1212,43.440860215053803,144,5.1612903225806503,2790,100]
["137",489,17.977941176470601,216,7.9411764705882399,636,23.382352941176499,1215,44.669117647058798,164,6.0294117647058796,2720,100]
["138",507,18.8335809806835,211,7.8380386329866303,629,23.3655274888559,1169,43.424962852897501,176,6.5378900445765202,2692,100]
["139",605,21.438695960311801,236,8.3628632175761908,641,22.7143869596031,1197,42.416725726435203,143,5.0673281360737104,2822,100]
["141",1128,20.244077530509699,1214,21.787508973438602,1084,19.4544149318019,1638,29.396984924623101,508,9.1170136396267107,5572,100]
["142",1205,21.088554427721402,1271,22.243612180608999,1087,19.023451172558602,1727,30.22401120056,424,7.42037101855093,5714,100]
["143",1269,22.019781363873001,1303,22.609751865347899,1106,19.1913933715079,1765,30.626409855977801,320,5.5526635432934199,5763,100]
["144",1304,22.591822591822599,1291,22.3665973665974,1169,20.252945252945299,1759,30.474705474705502,249,4.31392931392931,5772,100]
["145",1344,23.3698487219614,1275,22.170057381325002,1168,20.3095113893236,1706,29.664406190227801,258,4.4861763171622302,5751,100]
["146",1307,23.737740646567399,1216,22.084998183799499,1075,19.524155466763499,1617,29.367962223029402,291,5.28514347984017,5506,100]
["147",1210,22.608370702541102,1140,21.300448430493301,1067,19.936472346786299,1626,30.381165919282498,309,5.7735426008968602,5352,100]
["148",1214,22.5776455272457,1173,21.815138553096499,1071,19.918169983262,1599,29.737771991816999,320,5.9512739445787597,5377,100]
["149",1347,23.7901801483575,1285,22.6951607205934,1093,19.304132815259599,1605,28.346873896149798,332,5.8636524196397,5662,100]
["211",603,36.413043478260903,725,43.780193236715,137,8.2729468599033797,104,6.2801932367149798,87,5.2536231884057996,1656,100]
["212",651,38.159437280187603,753,44.138335287221601,141,8.2649472450175896,108,6.3305978898006998,53,3.1066822977725699,1706,100]
["213",614,37.507635919364702,726,44.349419670128299,163,9.9572388515577295,102,6.2309102015882702,32,1.9547953573610299,1637,100]
{"$rows_left_out":177}