{"text_format":"1","workbook":"xlsx","n_sheets":11,"sheets":["Contents","Table 1","Fig 1","Fig 2","Table 2","Fig 3","data2","Fig 4","Lookups","Data DCE","Data DCE2"],"not_rendered":{"charts":4,"images":4,"macros":1,"external_links":0,"defined_names":3,"comments":0,"pivot_tables":0},"unopened":[],"bounds":{"document_bytes":16777216,"sheet_cells":100000,"rows_first":2000,"rows_last":500,"rows_between":2000,"halvings":0,"cell_chars":16384,"cell_head_chars":4096},"cells_cut":0,"cells_raw":0,"read":"whole","date_system":"1900"}

{"sheet":"Contents","index":0,"n_rows":54,"n_cols":3,"rows_kept":54,"cut":false,"hidden":false,"merged":[[53,0,54,15],[4,0,6,13],[10,2,10,4],[39,0,42,15],[44,0,46,16],[48,0,51,15]]}
["Detect Cancer Early - Year 8 Staging Data"]
[]
["In order to view the tables to full effect, the macros will need to be enabled. To do this, select options – enable this content."]
[]
["The following tables and figures present the Detect Cancer Early trend data from Baseline (2010 & 2011) to Year 8 (2018 & 2019). Information is presented for breast, colorectal and lung cancer combined as well as indivdually. The percentage change in stage 1 at diagnosis from the baseline to year 8 is used for monitoring performance towards the DCE LDP standard. "]
[]
[]
[]
[null,"Time period: ","01 January 2010 - 31 December 2019"]
[null,"Source: ","ISD Detect Cancer Early data collected from local National Prospective Cancer Audit data sets"]
[null,"Extract date: ","2020-10-20"]
[]
["Use the hyperlinks in the lists below to nativigate to the required table or figure;"]
[]
["List of Tables"]
{"$rows_left_out":40}
{"sheet":"Table 1","index":1,"n_rows":38,"n_cols":20,"rows_kept":38,"cut":false,"hidden":false,"merged":[[8,17,8,18],[8,0,9,0],[8,2,8,3],[8,5,8,6],[8,8,8,9],[8,11,8,12],[8,14,8,15]]}
["Detect Cancer Early - Trend Staging Data"]
[{"$f":"\"Table 1: Number and percentage of patients by stage at diagnosis for (\"&(VLOOKUP($T$2,Lookups!$A$30:$B$33,2,0))&\") - by NHS Board of residence for \"&(VLOOKUP($T$3,Lookups!$A$1:$B$9,2,0))&\" combined\"","v":"Table 1: Number and percentage of patients by stage at diagnosis for (Breast, Colorectal & Lung combined) - by NHS Board of residence for Year 8 2018-2019 combined"},null,null,null,null,null,null,null,null,null,null,null,null,null,null,null,null,null,null,4]
[null,null,null,null,null,null,null,null,null,null,null,null,null,null,null,null,null,null,null,9]
["Please select which years you require:",null,null,null,null,null,null,null,null,null,null,null,null,null,null,null,null,null,null,{"$f":"CONCATENATE(T2,T3)","v":"49"}]
[]
["Please select which cancer type you require : "]
[]
[]
["Area of Residence",null,"Stage 1",null,null,"Stage 2",null,null,"Stage 3",null,null,"Stage 4",null,null,"Stage Not Known",null,null,"Total"]
[null,null,"Number","%",null,"Number","%",null,"Number","%",null,"Number","%",null,"Number","%",null,"Number","%"]
[]
["NHS SCOTLAND",null,{"$f":"VLOOKUP(\"M\"&$T$4,'Data DCE'!$A$1:$M$649,2,FALSE)","v":6510},{"$f":"VLOOKUP(\"M\"&$T$4,'Data DCE'!$A$1:$M$649,3,FALSE)","v":25.617818353533799},null,{"$f":"VLOOKUP(\"M\"&$T$4,'Data DCE'!$A$1:$M$649,4,FALSE)","v":6470},{"$f":"VLOOKUP(\"M\"&$T$4,'Data DCE'!$A$1:$M$649,5,FALSE)","v":25.460412403588901},null,{"$f":"VLOOKUP(\"M\"&$T$4,'Data DCE'!$A$1:$M$649,6,FALSE)","v":4381},{"$f":"VLOOKUP(\"M\"&$T$4,'Data DCE'!$A$1:$M$649,7,FALSE)","v":17.239886667716},null,{"$f":"VLOOKUP(\"M\"&$T$4,'Data DCE'!$A$1:$M$649,8,FALSE)","v":6437},{"$f":"VLOOKUP(\"M\"&$T$4,'Data DCE'!$A$1:$M$649,9,FALSE)","v":25.330552494884301},null,{"$f":"VLOOKUP(\"M\"&$T$4,'Data DCE'!$A$1:$M$649,10,FALSE)","v":1614},{"$f":"VLOOKUP(\"M\"&$T$4,'Data DCE'!$A$1:$M$649,11,FALSE)","v":6.3513300802770303},null,{"$f":"VLOOKUP(\"M\"&$T$4,'Data DCE'!$A$1:$M$649,12,FALSE)","v":25412},{"$f":"VLOOKUP(\"M\"&$T$4,'Data DCE'!$A$1:$M$649,13,FALSE)","v":100}]
[]
["NCA",null,{"$f":"VLOOKUP(\"C\"&$T$4,'Data DCE'!$A$1:$M$649,2,FALSE)","v":1571},{"$f":"VLOOKUP(\"C\"&$T$4,'Data DCE'!$A$1:$M$649,3,FALSE)","v":24.783088815270499},null,{"$f":"VLOOKUP(\"C\"&$T$4,'Data DCE'!$A$1:$M$649,4,FALSE)","v":1650},{"$f":"VLOOKUP(\"C\"&$T$4,'Data DCE'!$A$1:$M$649,5,FALSE)","v":26.029342167534299},null,{"$f":"VLOOKUP(\"C\"&$T$4,'Data DCE'!$A$1:$M$649,6,FALSE)","v":1093},{"$f":"VLOOKUP(\"C\"&$T$4,'Data DCE'!$A$1:$M$649,7,FALSE)","v":17.242467266130301},null,{"$f":"VLOOKUP(\"C\"&$T$4,'Data DCE'!$A$1:$M$649,8,FALSE)","v":1552},{"$f":"VLOOKUP(\"C\"&$T$4,'Data DCE'!$A$1:$M$649,9,FALSE)","v":24.4833569963717},null,{"$f":"VLOOKUP(\"C\"&$T$4,'Data DCE'!$A$1:$M$649,10,FALSE)","v":473},{"$f":"VLOOKUP(\"C\"&$T$4,'Data DCE'!$A$1:$M$649,11,FALSE)","v":7.4617447546931697},null,{"$f":"VLOOKUP(\"C\"&$T$4,'Data DCE'!$A$1:$M$649,12,FALSE)","v":6339},{"$f":"VLOOKUP(\"C\"&$T$4,'Data DCE'!$A$1:$M$649,13,FALSE)","v":100}]
["NHS Grampian",null,{"$f":"VLOOKUP(\"N\"&$T$4,'Data DCE'!$A$1:$M$649,2,FALSE)","v":588},{"$f":"VLOOKUP(\"N\"&$T$4,'Data DCE'!$A$1:$M$649,3,FALSE)","v":22.977725674091399},null,{"$f":"VLOOKUP(\"N\"&$T$4,'Data DCE'!$A$1:$M$649,4,FALSE)","v":634},{"$f":"VLOOKUP(\"N\"&$T$4,'Data DCE'!$A$1:$M$649,5,FALSE)","v":24.775302852676798},null,{"$f":"VLOOKUP(\"N\"&$T$4,'Data DCE'!$A$1:$M$649,6,FALSE)","v":422},{"$f":"VLOOKUP(\"N\"&$T$4,'Data DCE'!$A$1:$M$649,7,FALSE)","v":16.490816725283299},null,{"$f":"VLOOKUP(\"N\"&$T$4,'Data DCE'!$A$1:$M$649,8,FALSE)","v":695},{"$f":"VLOOKUP(\"N\"&$T$4,'Data DCE'!$A$1:$M$649,9,FALSE)","v":27.1590465025401},null,{"$f":"VLOOKUP(\"N\"&$T$4,'Data DCE'!$A$1:$M$649,10,FALSE)","v":220},{"$f":"VLOOKUP(\"N\"&$T$4,'Data DCE'!$A$1:$M$649,11,FALSE)","v":8.5971082454083607},null,{"$f":"VLOOKUP(\"N\"&$T$4,'Data DCE'!$A$1:$M$649,12,FALSE)","v":2559},{"$f":"VLOOKUP(\"N\"&$T$4,'Data DCE'!$A$1:$M$649,13,FALSE)","v":100}]
{"$rows_left_out":24}
{"sheet":"Fig 1","index":2,"n_rows":52,"n_cols":18,"rows_kept":52,"cut":false,"hidden":false,"merged":[[48,0,48,18]]}
["Detect Cancer Early - Trend Staging Data",null,null,null,null,null,null,null,null,null,null,null,null,null,null,null,null,"back to contents"]
[]
[{"$f":"\"Figure 1: Stage distribution for (\"&(VLOOKUP('Table 1'!T2,Lookups!$A$30:$B$33,2,0))&\") - by NHS Board of residence for \"&(VLOOKUP('Table 1'!T3,Lookups!$A$1:$B$9,2,0))&\" combined\"","v":"Figure 1: Stage distribution for (Breast, Colorectal & Lung combined) - by NHS Board of residence for Year 8 2018-2019 combined"}]
[]
[]
[]
[]
[]
[]
[]
[]
[]
[]
[]
[]
{"$rows_left_out":38}
{"sheet":"Fig 2","index":3,"n_rows":52,"n_cols":18,"rows_kept":52,"cut":false,"hidden":false,"merged":[[2,0,3,18],[48,0,48,18]]}
[{"$f":"\"Detect Cancer Early - Year 8 Staging Data\"","v":"Detect Cancer Early - Year 8 Staging Data"},null,null,null,null,null,null,null,null,null,null,null,null,null,null,null,null,"back to contents"]
[]
[{"$f":"\"Figure 2: Trend in percentage of patients diagnosed at each stage for breast, colorectal and lung cancer in Scotland.\"","v":"Figure 2: Trend in percentage of patients diagnosed at each stage for breast, colorectal and lung cancer in Scotland."}]
[]
[]
[]
[]
[]
[]
[]
[]
[]
[]
[]
[]
{"$rows_left_out":38}
{"sheet":"Table 2","index":4,"n_rows":38,"n_cols":36,"rows_kept":38,"cut":false,"hidden":false,"merged":[[6,33,6,35],[36,0,36,27],[1,0,1,18],[6,29,6,31],[37,0,38,18],[6,25,6,27],[6,21,6,23],[6,0,7,0],[6,2,6,3],[6,5,6,7],[6,9,6,11],[6,13,6,15],[6,17,6,19]]}
["Detect Cancer Early - Trend Staging Data"]
[{"$f":"\"Table 2: Number and percentage of patients by combined year for (\"&(VLOOKUP($T$2,Lookups!$A$30:$B$33,2,0))&\") - by NHS Board of residence for \"&(VLOOKUP($T$3,Lookups!$A$35:$B$39,2,0))","v":"Table 2: Number and percentage of patients by combined year for (Breast, Colorectal & Lung combined) - by NHS Board of residence for Stage 1"},null,null,null,null,null,null,null,null,null,null,null,null,null,null,null,null,null,null,4]
[null,null,null,null,null,null,null,null,null,null,null,null,null,null,null,null,null,null,null,1]
["Please select which cancer type you require : ",null,null,null,null,null,null,null,null,null,null,null,null,null,null,null,null,null,null,{"$f":"CONCATENATE(T2,T3)","v":"41"}]
[]
[]
["Area of Residence",null,"Baseline 2010 - 2011",null,null,"Year 1 2011 - 2012",null,null,null,"Year 2 2012 - 2013",null,null,null,"Year 3 2013 - 2014",null,null,null,"Year 4 2014 - 2015",null,null,null,"Year 5 2015 - 2016",null,null,null,"Year 6 2016 - 2017",null,null,null,"Year 7 2017 - 2018",null,null,null,"Year 8 2018 - 2019"]
[null,null,"Number","%",null,"Number","%","% Change",null,"Number","%","% Change",null,"Number","%","% Change",null,"Number","%","% Change",null,"Number","%","% Change",null,"Number","%","% Change",null,"Number","%","% Change",null,"Number","%","% Change"]
[]
["NHS SCOTLAND",null,{"$f":"VLOOKUP(\"M\"&$T$4,'Data DCE2'!$A$1:$S$433,2,FALSE)","v":5581},{"$f":"VLOOKUP(\"M\"&$T$4,'Data DCE2'!$A$1:$S$433,3,FALSE)","v":23.3231643612353},null,{"$f":"VLOOKUP(\"M\"&$T$4,'Data DCE2'!$A$1:$S$433,4,FALSE)","v":5946},{"$f":"VLOOKUP(\"M\"&$T$4,'Data DCE2'!$A$1:$S$433,5,FALSE)","v":24.159928487261801},{"$f":"(G10-$D10)/$D10*100","v":3.5876955333610785},null,{"$f":"VLOOKUP(\"M\"&$T$4,'Data DCE2'!$A$1:$S$433,6,FALSE)","v":6074},{"$f":"VLOOKUP(\"M\"&$T$4,'Data DCE2'!$A$1:$S$433,7,FALSE)","v":24.564241517369702},{"$f":"(K10-$D10)/$D10*100","v":5.3212211555527924},null,{"$f":"VLOOKUP(\"M\"&$T$4,'Data DCE2'!$A$1:$S$433,8,FALSE)","v":6198},{"$f":"VLOOKUP(\"M\"&$T$4,'Data DCE2'!$A$1:$S$433,9,FALSE)","v":24.9547046744776},{"$f":"(O10-$D10)/$D10*100","v":6.9953642995117455},null,{"$f":"VLOOKUP(\"M\"&$T$4,'Data DCE2'!$A$1:$S$433,10,FALSE)","v":6272},{"$f":"VLOOKUP(\"M\"&$T$4,'Data DCE2'!$A$1:$S$433,11,FALSE)","v":25.2597664115989},{"$f":"(S10-$D10)/$D10*100","v":8.3033417780237642},null,{"$f":"VLOOKUP(\"M\"&$T$4,'Data DCE2'!$A$1:$S$433,12,FALSE)","v":6207},{"$f":"VLOOKUP(\"M\"&$T$4,'Data DCE2'!$A$1:$S$433,13,FALSE)","v":25.4447815036484},{"$f":"(W10-$D10)/$D10*100","v":9.0966093174705485},null,{"$f":"VLOOKUP(\"M\"&$T$4,'Data DCE2'!$A$1:$S$433,14,FALSE)","v":6155},{"$f":"VLOOKUP(\"M\"&$T$4,'Data DCE2'!$A$1:$S$433,15,FALSE)","v":25.2657936866303},{"$f":"(AA10-$D10)/$D10*100","v":8.3291842192039063},null,{"$f":"VLOOKUP(\"M\"&$T$4,'Data DCE2'!$A$1:$S$433,16,FALSE)","v":6336},{"$f":"VLOOKUP(\"M\"&$T$4,'Data DCE2'!$A$1:$S$433,17,FALSE)","v":25.510327334219099},{"$f":"(AE10-$D10)/$D10*100","v":9.3776424978551116},null,{"$f":"VLOOKUP(\"M\"&$T$4,'Data DCE2'!$A$1:$S$433,18,FALSE)","v":6510},{"$f":"VLOOKUP(\"M\"&$T$4,'Data DCE2'!$A$1:$S$433,19,FALSE)","v":25.617818353533799},{"$f":"(AI10-$D10)/$D10*100","v":9.8385191509963885}]
[]
["NCA",null,{"$f":"VLOOKUP(\"C\"&$T$4,'Data DCE2'!$A$1:$S$433,2,FALSE)","v":1328},{"$f":"VLOOKUP(\"C\"&$T$4,'Data DCE2'!$A$1:$S$433,3,FALSE)","v":22.650520211495799},null,{"$f":"VLOOKUP(\"C\"&$T$4,'Data DCE2'!$A$1:$S$433,4,FALSE)","v":1344},{"$f":"VLOOKUP(\"C\"&$T$4,'Data DCE2'!$A$1:$S$433,5,FALSE)","v":22.826086956521699},{"$f":"(G12-$D12)/$D12*100","v":0.77511131482443907},null,{"$f":"VLOOKUP(\"C\"&$T$4,'Data DCE2'!$A$1:$S$433,6,FALSE)","v":1399},{"$f":"VLOOKUP(\"C\"&$T$4,'Data DCE2'!$A$1:$S$433,7,FALSE)","v":23.4495474354677},{"$f":"(K12-$D12)/$D12*100","v":3.5276329925807688},null,{"$f":"VLOOKUP(\"C\"&$T$4,'Data DCE2'!$A$1:$S$433,8,FALSE)","v":1393},{"$f":"VLOOKUP(\"C\"&$T$4,'Data DCE2'!$A$1:$S$433,9,FALSE)","v":23.431455004205201},{"$f":"(O12-$D12)/$D12*100","v":3.4477565434150836},null,{"$f":"VLOOKUP(\"C\"&$T$4,'Data DCE2'!$A$1:$S$433,10,FALSE)","v":1389},{"$f":"VLOOKUP(\"C\"&$T$4,'Data DCE2'!$A$1:$S$433,11,FALSE)","v":22.9018961253092},{"$f":"(S12-$D12)/$D12*100","v":1.1098019447951606},null,{"$f":"VLOOKUP(\"C\"&$T$4,'Data DCE2'!$A$1:$S$433,12,FALSE)","v":1478},{"$f":"VLOOKUP(\"C\"&$T$4,'Data DCE2'!$A$1:$S$433,13,FALSE)","v":23.6177692553531},{"$f":"(W12-$D12)/$D12*100","v":4.270317126607952},null,{"$f":"VLOOKUP(\"C\"&$T$4,'Data DCE2'!$A$1:$S$433,14,FALSE)","v":1460},{"$f":"VLOOKUP(\"C\"&$T$4,'Data DCE2'!$A$1:$S$433,15,FALSE)","v":23.6859182349124},{"$f":"(AA12-$D12)/$D12*100","v":4.5711887133219404},null,{"$f":"VLOOKUP(\"C\"&$T$4,'Data DCE2'!$A$1:$S$433,16,FALSE)","v":1504},{"$f":"VLOOKUP(\"C\"&$T$4,'Data DCE2'!$A$1:$S$433,17,FALSE)","v":24.1373776279891},{"$f":"(AE12-$D12)/$D12*100","v":6.5643411392321021},null,{"$f":"VLOOKUP(\"C\"&$T$4,'Data DCE2'!$A$1:$S$433,18,FALSE)","v":1571},{"$f":"VLOOKUP(\"C\"&$T$4,'Data DCE2'!$A$1:$S$433,19,FALSE)","v":24.783088815270499},{"$f":"(AI12-$D12)/$D12*100","v":9.4150976836830438}]
["NHS Grampian",null,{"$f":"VLOOKUP(\"N\"&$T$4,'Data DCE2'!$A$1:$S$433,2,FALSE)","v":468},{"$f":"VLOOKUP(\"N\"&$T$4,'Data DCE2'!$A$1:$S$433,3,FALSE)","v":21.636615811373101},null,{"$f":"VLOOKUP(\"N\"&$T$4,'Data DCE2'!$A$1:$S$433,4,FALSE)","v":494},{"$f":"VLOOKUP(\"N\"&$T$4,'Data DCE2'!$A$1:$S$433,5,FALSE)","v":22.6086956521739},4.492753623188305,null,{"$f":"VLOOKUP(\"N\"&$T$4,'Data DCE2'!$A$1:$S$433,6,FALSE)","v":513},{"$f":"VLOOKUP(\"N\"&$T$4,'Data DCE2'!$A$1:$S$433,7,FALSE)","v":23.794063079777398},9.9712787212788321,null,{"$f":"VLOOKUP(\"N\"&$T$4,'Data DCE2'!$A$1:$S$433,8,FALSE)","v":503},{"$f":"VLOOKUP(\"N\"&$T$4,'Data DCE2'!$A$1:$S$433,9,FALSE)","v":22.708803611738102},4.9554320773279814,null,{"$f":"VLOOKUP(\"N\"&$T$4,'Data DCE2'!$A$1:$S$433,10,FALSE)","v":514},{"$f":"VLOOKUP(\"N\"&$T$4,'Data DCE2'!$A$1:$S$433,11,FALSE)","v":22.5142356548401},4.0561788919211912,null,{"$f":"VLOOKUP(\"N\"&$T$4,'Data DCE2'!$A$1:$S$433,12,FALSE)","v":533},{"$f":"VLOOKUP(\"N\"&$T$4,'Data DCE2'!$A$1:$S$433,13,FALSE)","v":23.063608827347501},6.5952690033175774,null,{"$f":"VLOOKUP(\"N\"&$T$4,'Data DCE2'!$A$1:$S$433,14,FALSE)","v":536},{"$f":"VLOOKUP(\"N\"&$T$4,'Data DCE2'!$A$1:$S$433,15,FALSE)","v":22.5589225589226},4.2627125960460779,null,{"$f":"VLOOKUP(\"N\"&$T$4,'Data DCE2'!$A$1:$S$433,16,FALSE)","v":552},{"$f":"VLOOKUP(\"N\"&$T$4,'Data DCE2'!$A$1:$S$433,17,FALSE)","v":22.439024390243901},{"$f":"(AE13-$D13)/$D13*100","v":3.7085678549092727},null,{"$f":"VLOOKUP(\"N\"&$T$4,'Data DCE2'!$A$1:$S$433,18,FALSE)","v":588},{"$f":"VLOOKUP(\"N\"&$T$4,'Data DCE2'!$A$1:$S$433,19,FALSE)","v":22.977725674091399},{"$f":"(AI13-$D13)/$D13*100","v":6.1983346860249515}]
["NHS Highland",null,{"$f":"VLOOKUP(\"H\"&$T$4,'Data DCE2'!$A$1:$S$433,2,FALSE)","v":375},{"$f":"VLOOKUP(\"H\"&$T$4,'Data DCE2'!$A$1:$S$433,3,FALSE)","v":25.6322624743677},null,{"$f":"VLOOKUP(\"H\"&$T$4,'Data DCE2'!$A$1:$S$433,4,FALSE)","v":346},{"$f":"VLOOKUP(\"H\"&$T$4,'Data DCE2'!$A$1:$S$433,5,FALSE)","v":22.838283828382799},-10.90024202420244,null,{"$f":"VLOOKUP(\"H\"&$T$4,'Data DCE2'!$A$1:$S$433,6,FALSE)","v":406},{"$f":"VLOOKUP(\"H\"&$T$4,'Data DCE2'!$A$1:$S$433,7,FALSE)","v":24.938574938574899},-2.7063063063063182,null,{"$f":"VLOOKUP(\"H\"&$T$4,'Data DCE2'!$A$1:$S$433,8,FALSE)","v":349},{"$f":"VLOOKUP(\"H\"&$T$4,'Data DCE2'!$A$1:$S$433,9,FALSE)","v":23.904109589041099},-6.7421004566208556,null,{"$f":"VLOOKUP(\"H\"&$T$4,'Data DCE2'!$A$1:$S$433,10,FALSE)","v":344},{"$f":"VLOOKUP(\"H\"&$T$4,'Data DCE2'!$A$1:$S$433,11,FALSE)","v":22.8875582168995},-10.708006209802621,null,{"$f":"VLOOKUP(\"H\"&$T$4,'Data DCE2'!$A$1:$S$433,12,FALSE)","v":404},{"$f":"VLOOKUP(\"H\"&$T$4,'Data DCE2'!$A$1:$S$433,13,FALSE)","v":24.8004910988336},-3.2450173930837054,null,{"$f":"VLOOKUP(\"H\"&$T$4,'Data DCE2'!$A$1:$S$433,14,FALSE)","v":354},{"$f":"VLOOKUP(\"H\"&$T$4,'Data DCE2'!$A$1:$S$433,15,FALSE)","v":23.7106496985934},-7.4968519758874779,null,{"$f":"VLOOKUP(\"H\"&$T$4,'Data DCE2'!$A$1:$S$433,16,FALSE)","v":384},{"$f":"VLOOKUP(\"H\"&$T$4,'Data DCE2'!$A$1:$S$433,17,FALSE)","v":24.983734547820401},-2.5301236174365327,null,{"$f":"VLOOKUP(\"H\"&$T$4,'Data DCE2'!$A$1:$S$433,18,FALSE)","v":433},{"$f":"VLOOKUP(\"H\"&$T$4,'Data DCE2'!$A$1:$S$433,19,FALSE)","v":27.7386290839206},8.2176382660690592]
["NHS Orkney",null,{"$f":"VLOOKUP(\"R\"&$T$4,'Data DCE2'!$A$1:$S$433,2,FALSE)","v":13},{"$f":"VLOOKUP(\"R\"&$T$4,'Data DCE2'!$A$1:$S$433,3,FALSE)","v":19.696969696969699},null,{"$f":"VLOOKUP(\"R\"&$T$4,'Data DCE2'!$A$1:$S$433,4,FALSE)","v":26},{"$f":"VLOOKUP(\"R\"&$T$4,'Data DCE2'!$A$1:$S$433,5,FALSE)","v":28.260869565217401},43.478260869565254,null,{"$f":"VLOOKUP(\"R\"&$T$4,'Data DCE2'!$A$1:$S$433,6,FALSE)","v":23},{"$f":"VLOOKUP(\"R\"&$T$4,'Data DCE2'!$A$1:$S$433,7,FALSE)","v":27.380952380952401},39.0109890109891,null,{"$f":"VLOOKUP(\"R\"&$T$4,'Data DCE2'!$A$1:$S$433,8,FALSE)","v":12},{"$f":"VLOOKUP(\"R\"&$T$4,'Data DCE2'!$A$1:$S$433,9,FALSE)","v":20.338983050847499},3.2594524119949861,null,{"$f":"VLOOKUP(\"R\"&$T$4,'Data DCE2'!$A$1:$S$433,10,FALSE)","v":25},{"$f":"VLOOKUP(\"R\"&$T$4,'Data DCE2'!$A$1:$S$433,11,FALSE)","v":27.173913043478301},37.959866220735975,null,{"$f":"VLOOKUP(\"R\"&$T$4,'Data DCE2'!$A$1:$S$433,12,FALSE)","v":22},{"$f":"VLOOKUP(\"R\"&$T$4,'Data DCE2'!$A$1:$S$433,13,FALSE)","v":22.4489795918367},13.971742543170929,null,{"$f":"VLOOKUP(\"R\"&$T$4,'Data DCE2'!$A$1:$S$433,14,FALSE)","v":9},{"$f":"VLOOKUP(\"R\"&$T$4,'Data DCE2'!$A$1:$S$433,15,FALSE)","v":14.0625},-28.605769230769241,null,{"$f":"VLOOKUP(\"R\"&$T$4,'Data DCE2'!$A$1:$S$433,16,FALSE)","v":26},{"$f":"VLOOKUP(\"R\"&$T$4,'Data DCE2'!$A$1:$S$433,17,FALSE)","v":28.8888888888889},46.666666666666707,null,{"$f":"VLOOKUP(\"R\"&$T$4,'Data DCE2'!$A$1:$S$433,18,FALSE)","v":28},{"$f":"VLOOKUP(\"R\"&$T$4,'Data DCE2'!$A$1:$S$433,19,FALSE)","v":27.184466019417499},38.013442867811904]
{"$rows_left_out":24}
{"sheet":"Fig 3","index":5,"n_rows":52,"n_cols":18,"rows_kept":52,"cut":false,"hidden":false,"merged":[[2,0,3,18],[48,0,48,18],[51,0,52,17]]}
[{"$f":"\"Detect Cancer Early - Year 8 Staging Data\"","v":"Detect Cancer Early - Year 8 Staging Data"},null,null,null,null,null,null,null,null,null,null,null,null,null,null,null,null,"back to contents"]
[]
[{"$f":"\"Figure 3: Percentage change in stage 1 at diagnosis from baseline to year 8\" & \" for (\"&(VLOOKUP('Table 2'!T2,Lookups!$A$30:$B$33,2,0))&\") by NHS Board of residence.\"","v":"Figure 3: Percentage change in stage 1 at diagnosis from baseline to year 8 for (Breast, Colorectal & Lung combined) by NHS Board of residence."}]
[]
[]
[]
[]
[]
[]
[]
[]
[]
[]
[]
[]
{"$rows_left_out":38}
{"sheet":"data2","index":6,"n_rows":45,"n_cols":15,"rows_kept":45,"cut":false,"hidden":true,"merged":[]}
["Stage 1","Baseline",23.3231643612353,null,null,null,null,null,"Stage 1","Baseline",0]
[null,"Year 1",24.159928487261801,null,null,null,null,null,null,"Year 1",{"$f":"(C2-C$1)/C$1","v":3.5876955333610787E-2}]
[null,"Year 2",24.564241517369702,null,null,null,null,null,null,"Year 2",{"$f":"(C3-C$1)/C$1","v":5.3212211555527925E-2}]
[null,"Year 3",24.9547046744776,null,null,null,null,null,null,"Year 3",{"$f":"(C4-C$1)/C$1","v":6.9953642995117457E-2}]
[null,"Year 4",25.2597664115989,null,null,null,null,null,null,"Year 4",8.3033417780237651E-2]
[null,"Year 5",25.4447815036484,null,null,null,null,null,null,"Year 5",9.0966093174705484E-2]
[null,"Year 6",25.2657936866303,null,null,null,null,null,null,"Year 6",8.3291842192039056E-2]
[null,"Year 7",25.510327334219099,null,null,null,null,null,null,"Year 7",{"$f":"(C8-C$1)/C$1","v":9.3776424978551112E-2}]
[null,"Year 8",25.617818353533799,null,null,null,null,null,null,"Year 8",{"$f":"(C9-C$1)/C$1","v":9.8385191509963887E-2}]
["Stage 2","Baseline",null,25.320740524050301,null,null,null,null,"Stage 2","Baseline",null,0]
[null,"Year 1",null,25.342326601926001,null,null,null,null,null,"Year 1",null,{"$f":"(D11-D$10)/D$10","v":8.5250578888862872E-4}]
[null,"Year 2",null,25.506531322036601,null,null,null,null,null,"Year 2",null,7.3374946443541447E-3]
[null,"Year 3",null,25.5264323388493,null,null,null,null,null,"Year 3",null,8.123451784659624E-3]
[null,"Year 4",null,25.9484494563029,null,null,null,null,null,"Year 4",null,2.4790307047157033E-2]
[null,"Year 5",null,25.944904484709401,null,null,null,null,null,"Year 5",null,2.4650304364765827E-2]
{"$rows_left_out":31}
{"sheet":"Fig 4","index":7,"n_rows":54,"n_cols":18,"rows_kept":54,"cut":false,"hidden":false,"merged":[[2,0,3,18],[48,0,48,18],[51,0,52,12]]}
[{"$f":"\"Detect Cancer Early - Year 8 Staging Data\"","v":"Detect Cancer Early - Year 8 Staging Data"},null,null,null,null,null,null,null,null,null,null,null,null,null,null,null,null,"back to contents"]
[]
[{"$f":"\"Figure 4: Trend in percentage change from baseline for each stage for breast, colorectal and lung cancer in Scotland.\"","v":"Figure 4: Trend in percentage change from baseline for each stage for breast, colorectal and lung cancer in Scotland."}]
[]
[]
[]
[]
[]
[]
[]
[]
[]
[]
[]
[]
{"$rows_left_out":40}
{"sheet":"Lookups","index":8,"n_rows":39,"n_cols":2,"rows_kept":39,"cut":false,"hidden":true,"merged":[]}
[1,"Baseline 2010-2011"]
[2,"Year 1 2011-2012"]
[3,"Year 2 2012-2013"]
[4,"Year 3 2013-2014"]
[5,"Year 4 2014-2015"]
[6,"Year 5 2015-2016"]
[7,"Year 6 2016-2017"]
[8,"Year 7 2017-2018"]
[9,"Year 8 2018-2019"]
[]
["M","Scotland"]
["C","NOSCAN"]
["N","Grampian NHS Board"]
["H","Highland NHS Board"]
["R","Orkney NHS Board"]
{"$rows_left_out":25}
{"sheet":"Data DCE","index":9,"n_rows":649,"n_cols":13,"rows_kept":649,"cut":false,"hidden":true,"merged":[]}
["Lookup","Stage 1","%","Stage 2","%","Stage 3","%","Stage 4","%","Stage Not Known","%","Total","%"]
["A11",264,39.759036144578303,289,43.524096385542201,49,7.3795180722891596,36,5.4216867469879499,26,3.9156626506024099,664,100]
["A12",255,40.540540540540498,287,45.627980922098601,36,5.7233704292527801,40,6.3593004769475403,11,1.74880763116057,629,100]
["A13",250,39.184952978056401,307,48.119122257053299,43,6.7398119122257096,32,5.0156739811912203,6,0.94043887147335403,638,100]
["A14",267,41.331269349845201,299,46.2848297213622,36,5.5727554179566603,38,5.8823529411764701,6,0.92879256965944301,646,100]
["A15",267,41.203703703703702,304,46.913580246913597,26,4.0123456790123502,46,7.0987654320987703,5,0.77160493827160503,648,100]
["A16",282,42.469879518072297,307,46.234939759036102,28,4.2168674698795199,41,6.1746987951807197,6,0.90361445783132499,664,100]
["A17",313,44.842406876790797,318,45.558739255014302,34,4.8710601719197699,27,3.8681948424068802,6,0.85959885386819501,698,100]
["A18",282,42.152466367712996,313,46.786248131539601,34,5.0822122571001502,33,4.9327354260089704,7,1.0463378176382701,669,100]
["A19",185,33.213644524236997,247,44.344703770197498,33,5.9245960502693,34,6.10412926391382,58,10.412926391382401,557,100]
["A21",95,18.8118811881188,116,22.970297029703001,126,24.950495049505001,109,21.5841584158416,59,11.683168316831701,505,100]
["A22",117,22.674418604651201,131,25.3875968992248,108,20.930232558139501,119,23.062015503876001,41,7.9457364341085297,516,100]
["A23",127,23.649906890130399,143,26.6294227188082,113,21.042830540037201,114,21.229050279329599,40,7.4487895716945998,537,100]
["A24",102,19.354838709677399,146,27.703984819734298,135,25.6166982922201,103,19.544592030360501,41,7.7798861480075896,527,100]
["A25",83,16.147859922178998,140,27.237354085603101,147,28.599221789883298,102,19.844357976653701,42,8.1712062256809297,514,100]
{"$rows_left_out":635}
{"sheet":"Data DCE2","index":10,"n_rows":438,"n_cols":19,"rows_kept":438,"cut":false,"hidden":true,"merged":[]}
["Lookup Code","Baseline (2010-2011)","%","Year 1  (2011-2012)","%","Year 2  (2012-2013)","%","Year 3  (2013-2014)","%","Year 4  (2014-2015)","%","Year 5  (2015-2016)","%","Year 6  (2016-2017)","%","Year 7  (2017-2018)","%","Year 8  (2018-2019)","%"]
["A11",264,39.759036144578303,255,40.540540540540498,250,39.184952978056401,267,41.331269349845201,267,41.203703703703702,282,42.469879518072297,313,44.842406876790797,282,42.152466367712996,185,33.213644524236997]
["A12",289,43.524096385542201,287,45.627980922098601,307,48.119122257053299,299,46.2848297213622,304,46.913580246913597,307,46.234939759036102,318,45.558739255014302,313,46.786248131539601,247,44.344703770197498]
["A13",49,7.3795180722891596,36,5.7233704292527801,43,6.7398119122257096,36,5.5727554179566603,26,4.0123456790123502,28,4.2168674698795199,34,4.8710601719197699,34,5.0822122571001502,33,5.9245960502693]
["A14",36,5.4216867469879499,40,6.3593004769475403,32,5.0156739811912203,38,5.8823529411764701,46,7.0987654320987703,41,6.1746987951807197,27,3.8681948424068802,33,4.9327354260089704,34,6.10412926391382]
["A15",26,3.9156626506024099,11,1.74880763116057,6,0.94043887147335403,6,0.92879256965944301,5,0.77160493827160503,6,0.90361445783132499,6,0.85959885386819501,7,1.0463378176382701,58,10.412926391382401]
["A16",664,100,629,100,638,100,646,100,648,100,664,100,698,100,669,100,557,100]
["A21",95,18.8118811881188,117,22.674418604651201,127,23.649906890130399,102,19.354838709677399,83,16.147859922178998,84,16.3106796116505,85,15.9774436090226,66,12.244897959183699,54,10.384615384615399]
["A22",116,22.970297029703001,131,25.3875968992248,143,26.6294227188082,146,27.703984819734298,140,27.237354085603101,148,28.737864077669901,155,29.1353383458647,143,26.530612244897998,132,25.384615384615401]
["A23",126,24.950495049505001,108,20.930232558139501,113,21.042830540037201,135,25.6166982922201,147,28.599221789883298,125,24.271844660194201,126,23.684210526315798,131,24.304267161409999,107,20.576923076923102]
["A24",109,21.5841584158416,119,23.062015503876001,114,21.229050279329599,103,19.544592030360501,102,19.844357976653701,116,22.524271844660198,128,24.060150375939902,134,24.860853432281999,118,22.692307692307701]
["A25",59,11.683168316831701,41,7.9457364341085297,40,7.4487895716945998,41,7.7798861480075896,42,8.1712062256809297,42,8.1553398058252409,38,7.1428571428571397,65,12.0593692022263,109,20.961538461538499]
["A26",505,100,516,100,537,100,527,100,514,100,515,100,532,100,539,100,520,100]
["A31",89,13.4848484848485,98,13.764044943820201,103,13.5348226018397,121,14.9567367119901,134,17.0700636942675,130,18.0555555555556,122,17.207334273624799,126,17.721518987341799,132,18.5654008438819]
["A32",36,5.4545454545454497,42,5.8988764044943798,67,8.8042049934296998,68,8.4054388133498108,67,8.5350318471337605,69,9.5833333333333304,68,9.5909732016925293,56,7.8762306610407897,39,5.4852320675105499]
{"$rows_left_out":423}