{"text_format":"1","workbook":"xlsx","n_sheets":14,"sheets":["Welcome","1. Completed Waits Summary","comp1","percentage comp","2. Ongoing Waits Summary","ongoing1","percentage ongoing","3. Compliance","List","Sheet1","Sheet2","Sheet3","Sheet4","Sheet5"],"not_rendered":{"charts":0,"images":5,"macros":1,"external_links":0,"defined_names":22,"comments":0,"pivot_tables":0},"unopened":[],"bounds":{"document_bytes":16777216,"sheet_cells":100000,"rows_first":2000,"rows_last":500,"rows_between":2000,"halvings":0,"cell_chars":16384,"cell_head_chars":4096},"cells_cut":0,"cells_raw":0,"read":"whole","date_system":"1900"}

{"sheet":"Welcome","index":0,"n_rows":54,"n_cols":6,"rows_kept":54,"cut":false,"hidden":false,"merged":[[16,0,16,4],[80,0,80,7],[14,0,14,3],[15,0,15,4]]}
["Drug and Alcohol Treatment Waiting Times - Prisons"]
["January-March 2020"]
["Published 30th June 2020"]
[]
[]
[]
["LDP standard details "]
[]
[]
[]
{"$rows_left_out":45}
{"sheet":"1. Completed Waits Summary","index":1,"n_rows":50,"n_cols":18,"rows_kept":50,"cut":false,"hidden":false,"merged":[[1,2,1,7],[60,2,60,10],[7,4,7,14],[6,16,7,17],[58,2,58,3],[47,2,47,3],[44,16,44,23],[38,2,39,16],[44,24,44,31],[44,32,44,39],[44,40,44,47],[44,48,44,55],[44,56,44,63],[44,64,44,71],[44,72,44,79],[44,80,44,87],[44,88,44,95],[44,96,44,103],[44,104,44,111],[44,112,44,119],[44,200,44,207],[44,208,44,215],[44,120,44,127],[44,128,44,135],[44,136,44,143],[44,144,44,151],[44,152,44,159],[44,160,44,167],[44,168,44,175],[44,176,44,183],[44,184,44,191],[44,192,44,199],[44,216,44,223],[44,224,44,231],[44,232,44,239],[44,240,44,247],[44,248,44,255]]}
[null,null,{"$f":"\"Table 1 - Waiting Times for Referral to Treatment, \" &A6 & \", quarter ending \"&A4","v":"Table 1 - Waiting Times for Referral to Treatment, Alcohol and Drugs, quarter ending 31st March 2020"}]
[null,null,"Waiting times for clients who have started first treatment"]
["Scotland"]
["31st March 2020",{"$f":"VLOOKUP(A4,quarter,2,FALSE)","v":12},"Quarter ending"]
[]
["Alcohol and Drugs",{"$f":"VLOOKUP(A6,ClientType,2,FALSE)","v":"B"},"Client type"]
[null,null,null,null,null,null,null,null,null,null,null,null,null,null,null,null,"Performance against standard"]
["Source",null,null,null,"Distribution of completed wait"]
[null,null,"Area","Number of Completed Waits","Up to 1 week (%)","2 weeks (%)","3 weeks (%)","4 weeks (%)","5 weeks (%)","6 weeks (%)","7-8 weeks (%)","9-12 weeks (%)","13-16 weeks (%)","17-20 weeks (%)","21+ weeks (%)",null,"% seen within 3 weeks","% seen within 6 weeks"]
[999,{"$f":"CONCATENATE(A10,B$6,B$4)","v":"999B12"},"Scottish Prison Service",{"$f":"IF(ISERROR(VLOOKUP($B10,comp1!$A$1:$X$994,D$41,FALSE)),\"-\",VLOOKUP($B10,comp1!$A$1:$X$994,D$41,FALSE))","v":811},{"$f":"IF(ISERROR(VLOOKUP($B10,comp1!$A$1:$X$994,E$41,FALSE)),\"-\",VLOOKUP($B10,comp1!$A$1:$X$994,E$41,FALSE))","v":71.023427866831071},{"$f":"IF(ISERROR(VLOOKUP($B10,comp1!$A$1:$X$994,F$41,FALSE)),\"-\",VLOOKUP($B10,comp1!$A$1:$X$994,F$41,FALSE))","v":14.056720098643648},{"$f":"IF(ISERROR(VLOOKUP($B10,comp1!$A$1:$X$994,G$41,FALSE)),\"-\",VLOOKUP($B10,comp1!$A$1:$X$994,G$41,FALSE))","v":8.6313193588162758},{"$f":"IF(ISERROR(VLOOKUP($B10,comp1!$A$1:$X$994,H$41,FALSE)),\"-\",VLOOKUP($B10,comp1!$A$1:$X$994,H$41,FALSE))","v":2.342786683107275},{"$f":"IF(ISERROR(VLOOKUP($B10,comp1!$A$1:$X$994,I$41,FALSE)),\"-\",VLOOKUP($B10,comp1!$A$1:$X$994,I$41,FALSE))","v":1.4796547472256474},{"$f":"IF(ISERROR(VLOOKUP($B10,comp1!$A$1:$X$994,J$41,FALSE)),\"-\",VLOOKUP($B10,comp1!$A$1:$X$994,J$41,FALSE))","v":1.2330456226880395},{"$f":"IF(ISERROR(VLOOKUP($B10,comp1!$A$1:$X$994,K$41,FALSE)),\"-\",VLOOKUP($B10,comp1!$A$1:$X$994,K$41,FALSE))","v":0.61652281134401976},{"$f":"IF(ISERROR(VLOOKUP($B10,comp1!$A$1:$X$994,L$41,FALSE)),\"-\",VLOOKUP($B10,comp1!$A$1:$X$994,L$41,FALSE))","v":0.61652281134401976},{"$f":"IF(ISERROR(VLOOKUP($B10,comp1!$A$1:$X$994,M$41,FALSE)),\"-\",VLOOKUP($B10,comp1!$A$1:$X$994,M$41,FALSE))","v":0},{"$f":"IF(ISERROR(VLOOKUP($B10,comp1!$A$1:$X$994,N$41,FALSE)),\"-\",VLOOKUP($B10,comp1!$A$1:$X$994,N$41,FALSE))","v":0},{"$f":"IF(ISERROR(VLOOKUP($B10,comp1!$A$1:$X$994,O$41,FALSE)),\"-\",VLOOKUP($B10,comp1!$A$1:$X$994,O$41,FALSE))","v":0},null,{"$f":"IF(ISERROR(VLOOKUP($B10,'percentage comp'!$A$1:$P$994,15,FALSE)),\"-\",VLOOKUP($B10,'percentage comp'!$A$1:$P$994,15,FALSE))","v":93.711467324290993},{"$f":"IF(ISERROR(VLOOKUP($B10,'percentage comp'!$A$1:$P$994,16,FALSE)),\"-\",VLOOKUP($B10,'percentage comp'!$A$1:$P$994,16,FALSE))","v":98.766954377311961}]
{"$rows_left_out":41}
{"sheet":"comp1","index":2,"n_rows":331,"n_cols":24,"rows_kept":331,"cut":false,"hidden":true,"merged":[]}
["desc","u8","d8to14","d15to21","d22to28","d29to35","d36to42","w7to8wk","w9to12wk","w13to16wk","w17to20wk","w21plus","t1","pc_u8","pc_d8to14","pc_d15to21","pc_d22to28","pc_d29to35","pc_d36to42","pc_w7to8wk","pc_w9to12wk","pc_w13to16wk","pc_w17to20wk","pc_w21plus"]
["A202Pb11",111,17,5,0,0,0,0,0,0,0,0,133,83.458646616541358,12.781954887218044,3.7593984962406015,0,0,0,0,0,0,0,0]
["C203Pb11",31,0,0,0,0,0,0,0,0,0,0,31,100,0,0,0,0,0,0,0,0,0,0]
["G101Pb11",208,0,0,0,0,0,0,0,0,0,0,208,100,0,0,0,0,0,0,0,0,0,0]
["G763Pb11",81,0,0,0,0,0,0,0,0,0,0,81,100,0,0,0,0,0,0,0,0,0,0]
["H202Pb11",28,18,17,2,1,1,1,0,0,0,0,68,41.17647058823529,26.47058823529412,25,2.9411764705882351,1.4705882352941175,1.4705882352941175,1.4705882352941175,0,0,0,0]
["L202Pb11",7,0,0,0,0,0,0,0,0,0,0,7,100,0,0,0,0,0,0,0,0,0,0]
["N401Pb11",56,0,0,0,0,0,0,0,0,0,0,56,100,0,0,0,0,0,0,0,0,0,0]
["S203Pb11",39,48,23,1,0,0,1,3,1,0,0,116,33.620689655172413,41.379310344827587,19.827586206896552,0.86206896551724133,0,0,0.86206896551724133,2.5862068965517242,0.86206896551724133,0,0]
["S400Pb11",20,17,8,4,0,4,1,2,1,0,0,57,35.087719298245609,29.82456140350877,14.035087719298245,7.0175438596491224,0,7.0175438596491224,1.7543859649122806,3.5087719298245612,1.7543859649122806,0,0]
{"$rows_left_out":322}
{"sheet":"percentage comp","index":3,"n_rows":363,"n_cols":16,"rows_kept":363,"cut":false,"hidden":true,"merged":[]}
["desc","t1","pc_u8","pc_d8to14","pc_d15to21","pc_d22to28","pc_d29to35","pc_d36to42","pc_w7to8wk","pc_w9to12wk","pc_w13to16wk","pc_w17to20wk","pc_w21plus",null,"3weeks","6weeks"]
["A202Pb11",133,83.458646616541358,12.781954887218044,3.7593984962406015,0,0,0,0,0,0,0,0,null,{"$f":"SUM(C2:E2)","v":100.00000000000001},{"$f":"SUM(C2:H2)","v":100.00000000000001}]
["C203Pb11",31,100,0,0,0,0,0,0,0,0,0,0,null,{"$f":"SUM(C3:E3)","v":100},{"$f":"SUM(C3:H3)","v":100}]
["G101Pb11",208,100,0,0,0,0,0,0,0,0,0,0,null,100,100]
["G763Pb11",81,100,0,0,0,0,0,0,0,0,0,0,null,100,100]
["H202Pb11",68,41.17647058823529,26.47058823529412,25,2.9411764705882351,1.4705882352941175,1.4705882352941175,1.4705882352941175,0,0,0,0,null,92.647058823529406,98.52941176470587]
["L202Pb11",7,100,0,0,0,0,0,0,0,0,0,0,null,100,100]
["N401Pb11",56,100,0,0,0,0,0,0,0,0,0,0,null,100,100]
["S203Pb11",116,33.620689655172413,41.379310344827587,19.827586206896552,0.86206896551724133,0,0,0.86206896551724133,2.5862068965517242,0.86206896551724133,0,0,null,94.827586206896555,95.689655172413794]
["S400Pb11",57,35.087719298245609,29.82456140350877,14.035087719298245,7.0175438596491224,0,7.0175438596491224,1.7543859649122806,3.5087719298245612,1.7543859649122806,0,0,null,78.94736842105263,92.982456140350877]
{"$rows_left_out":354}
{"sheet":"2. Ongoing Waits Summary","index":4,"n_rows":49,"n_cols":18,"rows_kept":49,"cut":false,"hidden":false,"merged":[[7,4,7,14],[7,16,7,18],[60,2,60,10],[38,2,39,16]]}
[null,null,{"$f":"\"Table 2 - Waiting Times for Referral to Treatment, \" & A6 & \", quarter ending \" & A4","v":"Table 2 - Waiting Times for Referral to Treatment, Alcohol and Drugs, quarter ending 31st March 2020"}]
[null,null,"Waiting times for clients still waiting to start first treatment as of the end of the quarter"]
["Scotland"]
["31st March 2020",{"$f":"VLOOKUP(A4,quarter,2,FALSE)","v":12},"Quarter ending"]
[]
["Alcohol and Drugs",{"$f":"VLOOKUP(A6,ClientType,2,FALSE)","v":"B"},"Client type"]
[null,null,"Alcohol and Drugs"]
["Source",null,null,null,"Distribution of ongoing wait (as of end of quarter)",null,null,null,null,null,null,null,null,null,null,null,"Performance against standard"]
[null,null,"Area","Number of Ongoing Waits","Up to 1 week (%)","2 weeks (%)","3 weeks (%)","4 weeks (%)","5 weeks (%)","6 weeks (%)","7-8 weeks (%)","9-12 weeks (%)","13-16 weeks (%)","17-20 weeks (%)","21+ weeks (%)",null,"% waiting 3 weeks or less","% waiting 6 weeks or less"]
[999,{"$f":"CONCATENATE(A10,B$6,B$4)","v":"999B12"},"Scottish Prison Service",{"$f":"IF(ISERROR(VLOOKUP($B10,ongoing1!$A$1:$X$700,D$41,FALSE)),\"-\",VLOOKUP($B10,ongoing1!$A$1:$X$700,D$41,FALSE))","v":104},{"$f":"IF(ISERROR(VLOOKUP($B10,ongoing1!$A$1:$X$700,E$41,FALSE)),\"-\",VLOOKUP($B10,ongoing1!$A$1:$X$700,E$41,FALSE))","v":22.115384615384613},{"$f":"IF(ISERROR(VLOOKUP($B10,ongoing1!$A$1:$X$700,F$41,FALSE)),\"-\",VLOOKUP($B10,ongoing1!$A$1:$X$700,F$41,FALSE))","v":11.538461538461538},{"$f":"IF(ISERROR(VLOOKUP($B10,ongoing1!$A$1:$X$700,G$41,FALSE)),\"-\",VLOOKUP($B10,ongoing1!$A$1:$X$700,G$41,FALSE))","v":12.5},{"$f":"IF(ISERROR(VLOOKUP($B10,ongoing1!$A$1:$X$700,H$41,FALSE)),\"-\",VLOOKUP($B10,ongoing1!$A$1:$X$700,H$41,FALSE))","v":10.576923076923077},{"$f":"IF(ISERROR(VLOOKUP($B10,ongoing1!$A$1:$X$700,I$41,FALSE)),\"-\",VLOOKUP($B10,ongoing1!$A$1:$X$700,I$41,FALSE))","v":3.8461538461538463},{"$f":"IF(ISERROR(VLOOKUP($B10,ongoing1!$A$1:$X$700,J$41,FALSE)),\"-\",VLOOKUP($B10,ongoing1!$A$1:$X$700,J$41,FALSE))","v":9.6153846153846168},{"$f":"IF(ISERROR(VLOOKUP($B10,ongoing1!$A$1:$X$700,K$41,FALSE)),\"-\",VLOOKUP($B10,ongoing1!$A$1:$X$700,K$41,FALSE))","v":6.7307692307692308},{"$f":"IF(ISERROR(VLOOKUP($B10,ongoing1!$A$1:$X$700,L$41,FALSE)),\"-\",VLOOKUP($B10,ongoing1!$A$1:$X$700,L$41,FALSE))","v":4.8076923076923084},{"$f":"IF(ISERROR(VLOOKUP($B10,ongoing1!$A$1:$X$700,M$41,FALSE)),\"-\",VLOOKUP($B10,ongoing1!$A$1:$X$700,M$41,FALSE))","v":3.8461538461538463},{"$f":"IF(ISERROR(VLOOKUP($B10,ongoing1!$A$1:$X$700,N$41,FALSE)),\"-\",VLOOKUP($B10,ongoing1!$A$1:$X$700,N$41,FALSE))","v":0.96153846153846156},{"$f":"IF(ISERROR(VLOOKUP($B10,ongoing1!$A$1:$X$700,O$41,FALSE)),\"-\",VLOOKUP($B10,ongoing1!$A$1:$X$700,O$41,FALSE))","v":13.461538461538462},null,{"$f":"IF(ISERROR(VLOOKUP($B10,'percentage ongoing'!$A$1:$P$800,15,FALSE)),\"-\",VLOOKUP($B10,'percentage ongoing'!$A$1:$P$800,15,FALSE))","v":46.153846153846153},{"$f":"IF(ISERROR(VLOOKUP($B10,'percentage ongoing'!$A$1:$P$800,15,FALSE)),\"-\",VLOOKUP($B10,'percentage ongoing'!$A$1:$P$800,16,FALSE))","v":70.192307692307693}]
{"$rows_left_out":40}
{"sheet":"ongoing1","index":5,"n_rows":203,"n_cols":24,"rows_kept":203,"cut":false,"hidden":true,"merged":[]}
["desc","u8","d8to14","d15to21","d22to28","d29to35","d36to42","w7to8wk","w9to12wk","w13to16wk","w17to20wk","w21plus","t1","pc_u8","pc_d8to14","pc_d15to21","pc_d22to28","pc_d29to35","pc_d36to42","pc_w7to8wk","pc_w9to12wk","pc_w13to16wk","pc_w17to20wk","pc_w21plus"]
["A202Pb11",8,2,1,0,0,0,0,0,0,0,0,11,72.727272727272734,18.181818181818183,9.0909090909090917,0,0,0,0,0,0,0,0]
["H202Pb11",4,1,1,0,0,0,0,0,0,0,0,6,66.666666666666657,16.666666666666664,16.666666666666664,0,0,0,0,0,0,0,0]
["L202Pb11",1,0,0,0,0,0,0,0,0,0,0,"*",100,0,0,0,0,0,0,0,0,0,0]
["S203Pb11",17,6,6,0,0,0,1,2,0,0,0,32,53.125,18.75,18.75,0,0,0,3.125,6.25,0,0,0]
["S400Pb11",8,12,5,6,2,1,2,0,0,0,4,40,20,30,12.5,15,5,2.5,5,0,0,0,10]
["T101Pb11",6,4,2,0,0,0,0,0,0,0,0,12,50,33.333333333333329,16.666666666666664,0,0,0,0,0,0,0,0]
["V101Pb11",2,3,1,2,0,0,2,0,0,0,0,"*",20,30,10,20,0,0,20,0,0,0,0]
["V202Pb11",0,2,0,0,0,0,0,0,0,0,0,"*",0,100,0,0,0,0,0,0,0,0,0]
["Y101Pb11",0,1,0,0,0,0,0,0,0,0,1,"*",0,50,0,0,0,0,0,0,0,0,50]
{"$rows_left_out":194}
{"sheet":"percentage ongoing","index":6,"n_rows":264,"n_cols":16,"rows_kept":264,"cut":false,"hidden":true,"merged":[]}
["desc","t1","pc_u8","pc_d8to14","pc_d15to21","pc_d22to28","pc_d29to35","pc_d36to42","pc_w7to8wk","pc_w9to12wk","pc_w13to16wk","pc_w17to20wk","pc_w21plus",null,"3weeks","6weeks"]
["A202Pb11",11,72.727272727272734,18.181818181818183,9.0909090909090917,0,0,0,0,0,0,0,0,null,{"$f":"SUM(C2:E2)","v":100.00000000000001},{"$f":"SUM(C2:H2)","v":100.00000000000001}]
["H202Pb11",6,66.666666666666657,16.666666666666664,16.666666666666664,0,0,0,0,0,0,0,0,null,{"$f":"SUM(C3:E3)","v":99.999999999999972},{"$f":"SUM(C3:H3)","v":99.999999999999972}]
["L202Pb11",1,100,0,0,0,0,0,0,0,0,0,0,null,100,100]
["S203Pb11",32,53.125,18.75,18.75,0,0,0,3.125,6.25,0,0,0,null,90.625,90.625]
["S400Pb11",40,20,30,12.5,15,5,2.5,5,0,0,0,10,null,62.5,85]
["T101Pb11",12,50,33.333333333333329,16.666666666666664,0,0,0,0,0,0,0,0,null,100,100]
["V101Pb11",10,20,30,10,20,0,0,20,0,0,0,0,null,60,80]
["V202Pb11",2,0,100,0,0,0,0,0,0,0,0,0,null,100,100]
["Y101Pb11",2,0,50,0,0,0,0,0,0,0,0,50,null,50,50]
{"$rows_left_out":255}
{"sheet":"3. Compliance","index":7,"n_rows":26,"n_cols":19,"rows_kept":26,"cut":false,"hidden":false,"merged":[[3,16,3,18],[3,13,3,15]]}
["Table 3 - Compliance by ADP"]
[]
[]
[null,"2018-12-31",null,null,"2019-03-31",null,null,"2019-06-30",null,null,"2019-09-30",null,null,"2019-12-31",null,null,"2020-03-31"]
[null,"Total number of services","No. providing waiting times data","% providing waiting times data","Total number of services","No. providing waiting times data","% providing waiting times data","Total number of services","No. providing waiting times data","% providing waiting times data","Total number of services","No. providing waiting times data","% providing waiting times data","Total number of services","No. providing waiting times data","% providing waiting times data","Total number of services","No. providing waiting times data","% providing waiting times data"]
["Scotland",{"$f":"SUM(B9:B22)","v":15},{"$f":"SUM(C9:C22)","v":14},{"$f":"SUM(C6/B6)","v":0.93333333333333335},{"$f":"SUM(E9:E22)","v":15},{"$f":"SUM(F9:F22)","v":14},{"$f":"SUM(F6/E6)","v":0.93333333333333335},{"$f":"SUM(H9:H22)","v":15},{"$f":"SUM(I9:I22)","v":14},{"$f":"SUM(I6/H6)","v":0.93333333333333335},{"$f":"SUM(K9:K22)","v":15},{"$f":"SUM(L9:L22)","v":15},{"$f":"SUM(L6/K6)","v":1},{"$f":"SUM(N9:N22)","v":15},{"$f":"SUM(O9:O22)","v":15},{"$f":"SUM(O6/N6)","v":1},{"$f":"SUM(Q9:Q22)","v":15},{"$f":"SUM(R9:R22)","v":15},{"$f":"SUM(R6/Q6)","v":1}]
[]
["Alcohol & Drug Partnership"]
["East Ayrshire ",1,1,{"$f":"SUM(C9/B9)","v":1},1,1,{"$f":"SUM(F9/E9)","v":1},1,1,{"$f":"SUM(I9/H9)","v":1},1,1,{"$f":"SUM(L9/K9)","v":1},1,1,{"$f":"SUM(O9/N9)","v":1},1,1,{"$f":"SUM(R9/Q9)","v":1}]
["Dumfries & Galloway ",1,1,1,1,1,1,1,1,1,1,1,1,1,1,1,1,1,1]
{"$rows_left_out":17}
{"sheet":"List","index":8,"n_rows":59,"n_cols":17,"rows_kept":59,"cut":false,"hidden":true,"merged":[[0,0,0,3],[0,5,0,6],[0,7,0,8]]}
["Lookup: HBADAT",null,null,null,"Lookup: NHSBOARD","Lookup: ClientType",null,"Lookup: quarter",null,"Not lookup (concatenated on sheets)",null,null,null,null,null,"Lookup: source"]
["Scotland",999,"Scotland","14 of 15 prisons across Scotland submitted complete and accurate data for quarter ending March 2019. See the Compliance sheet for more info.","NHS Scotland","Alcohol and Drugs","B","31st March 2019",11,"NHS ScotlandDrugs",null,null,null,null,null,"Source","Source: Drug and Alcohol Treatment Waiting Times Database"]
[" Ayrshire & Arran NHS",202,"Ayrshire & Arran NHS","N/A","NHS Ayrshire & Arran","Alcohol","A","30th June 2019",21,"NHS Ayrshire & ArranDrugs"]
["East Ayrshire ADP",130,"East Ayrshire ADP","N/A","NHS Borders","Drugs","D","30th September 2019",31,"NHS BordersDrugs"]
["    North Ayrshire ADP",131,"North Ayrshire ADP","N/A","NHS Dumfries & Galloway",null,null,"31st December 2019",41,"NHS Dumfries & GallowayDrugs"]
["South Ayrshire ADP",132,"South Ayrshire ADP","N/A","NHS Fife",null,null,"31st March 2020",12,"NHS FifeDrugs"]
[" Borders NHS/ADP",106,"Borders NHS/ADP","N/A","NHS Forth Valley",null,null,null,null,"NHS Forth ValleyDrugs"]
[" Dumfries & Galloway NHS/ADP",107,"Dumfries & Galloway NHS/ADP","N/A","NHS Grampian",null,null,null,null,"NHS GrampianDrugs"]
[" Fife NHS/ADP",111,"Fife NHS/ADP","N/A","NHS Greater Glasgow & Clyde",null,null,null,null,"NHS Greater Glasgow & ClydeDrugs"]
[" Forth Valley NHS",206,"Forth Valley NHS","N/A","NHS Highland",null,null,null,null,"NHS HighlandDrugs"]
{"$rows_left_out":50}
{"sheet":"Sheet1","index":9,"n_rows":0,"n_cols":0,"rows_kept":0,"cut":false,"hidden":true,"merged":[]}

{"sheet":"Sheet2","index":10,"n_rows":0,"n_cols":0,"rows_kept":0,"cut":false,"hidden":true,"merged":[]}

{"sheet":"Sheet3","index":11,"n_rows":0,"n_cols":0,"rows_kept":0,"cut":false,"hidden":true,"merged":[]}

{"sheet":"Sheet4","index":12,"n_rows":0,"n_cols":0,"rows_kept":0,"cut":false,"hidden":true,"merged":[]}

{"sheet":"Sheet5","index":13,"n_rows":0,"n_cols":0,"rows_kept":0,"cut":false,"hidden":true,"merged":[]}